{"text_format":"1","workbook":"xlsx","n_sheets":17,"sheets":["readme","NZGP project list","assumptions","MCA - annual costs","MCA - costs split","Outputs - NEW","Calculations - NEW","Assumptions - with Mode added","Lines - BPE-TKU-A&B TTU","Lines - TKU-WKM TTU","Lines - TKU-WKM-AB Duplexing NZ","Lines - WRK-WKM-C TTU","Lines - EDG-KAW-3 TTU","Subs - BPE-TKU-WKM 1&2 Uprating","Subs - WRK-THI-WKM 1&1 Uprating","Subs - EDG-KAW Uprating","Subs - HVDC Capacity Stage 1"],"not_rendered":{"charts":1,"images":2,"macros":1,"external_links":0,"defined_names":1,"comments":0,"pivot_tables":1},"unopened":[],"bounds":{"document_bytes":16777216,"sheet_cells":100000,"rows_first":2000,"rows_last":500,"rows_between":2000,"halvings":0,"cell_chars":16384,"cell_head_chars":4096},"cells_cut":0,"cells_raw":0,"read":"whole","date_system":"1900"}

{"sheet":"readme","index":0,"n_rows":7,"n_cols":1,"rows_kept":7,"cut":false,"hidden":false,"merged":[]}
["Yellow worksheets Inputs used"]
["Green worksheets Outputs tabulated for inclusion in MCA documents incl. those in Attachment E"]
["Black worksheets include the MCA calculations - cost phasing by year and calculation of IDC and Inflation.."]
["Red worksheets - for a selected individual project contain costing inputs and workings for the P50 cost calculations. "]
["Beige worksheets shows the TEES estimates for the projects costed at TEES level.  "]
[]
["The workbook uses the Macro CreateAllOutputs"]

{"sheet":"NZGP project list","index":1,"n_rows":13,"n_cols":9,"rows_kept":13,"cut":false,"hidden":false,"merged":[]}
[]
[null,null,null,"Adjusted",null,"Original",null,"Adjusted"]
[null,null,null,"Construction",null,"Construction",null,"Construction"]
[null,null,null,"Start","Finish","Start","Finish","Start","Finish"]
[null,"CNI","Lines - BPE-TKU-A&B TTU",{"$f":"IF($D$2=\"Original\",F5,H5)","v":"2024-09-02"},{"$f":"IF($D$2=\"Original\",G5,I5)","v":"2026-12-31"},"2024-09-02","2027-06-30","2024-09-02","2026-12-31"]
[null,"CNI","Lines - TKU-WKM TTU",{"$f":"IF($D$2=\"Original\",F6,H6)","v":"2022-11-01"},{"$f":"IF($D$2=\"Original\",G6,I6)","v":"2024-12-31"},"2022-11-01","2024-06-30","2022-11-01","2024-12-31"]
[null,"CNI","Lines - TKU-WKM-AB Duplexing NZ","2024-09-01","2028-06-30","2024-09-01","2028-06-30","2024-09-01","2028-06-30"]
[null,"CNI","Subs - BPE-TKU-WKM 1&2 Uprating","2023-09-01","2026-12-31","2023-09-01","2026-06-30","2023-09-01","2026-12-31"]
{"$rows_left_out":6}
{"sheet":"assumptions","index":2,"n_rows":130,"n_cols":38,"rows_kept":130,"cut":false,"hidden":false,"merged":[]}
["Exchange rates (used in TEES - not used in this workbook)",null,null,null,null,null,null,null,null,null,null,null,"Interest Rates ",null,null,null,null,null,null,null,null,null,null,null,null,"CPI Updates (calculations use BYEFU2022 rates)"]
[]
["These rates are used in TEES but not this worksheet in which all costs have already been converted to NZD."]
["Currency ","Period Start ","Exchange Rate ",null,"NZD:USD rates",null,null,null,null,null,null,null,null,null,null,null,null,null,null,null,null,null,null,null,null,null,null,null,"actual Annual CPI to June 2022",7.2999999999999995E-2]
["AUD","2016-07-01",0.94569999999999999,null,"USD","2022-07-01",0.64119999999999999]
["AUD","2017-07-01",0.94974217532078198,null,"USD","2023-07-01",0.6391,null,null,null,null,null,null,null,null,null,null,null,null,null,null,null,null,null,null,null,null,null,null,2022,2023,2024,2025,2026,2027,2028,2029,2030]
["AUD","2018-07-01",0.91410000000000002,null,"USD","2024-07-01",0.63649999999999995,null,null,null,null,null,null,null,null,null,null,null,null,null,null,null,null,null,null,null,null,null,"BYEFU 19 May 2022",6.7000000000000004E-2,5.2000000000000005E-2,3.6000000000000004E-2,2.7000000000000003E-2,2.2000000000000002E-2,0.02,0.02,0.02,0.02]
["AUD","2019-07-01",0.92759999999999998,null,"USD","2025-07-01",0.64080000000000004,null,null,null,null,null,null,null,null,null,null,null,null,null,null,null,null,null,null,null,null,null,"RBNZ as August Monetary policy statement",6.3E-2,5.5E-2,3.4000000000000002E-2,2.1000000000000001E-2]
{"$rows_left_out":123}
{"sheet":"MCA - annual costs","index":3,"n_rows":79,"n_cols":22,"rows_kept":79,"cut":false,"hidden":false,"merged":[]}
[null,null,null,null,null,null,null,null,null,null,null,null,"Record of initial MCA"]
[null,"calculated - table included in MCA documents",null,null,null,null,null,null,null,null,null,null,"calculated - table included in MCA documents"]
[null,"Major Capex Allowance, $000, P50",2022,2023,2024,2025,2026,2027,2028,2029,"Total",null,"Major Capex Allowance, $000, P50",2022,2023,2024,2025,2026,2027,2028,2029,"Total"]
[null,"Capex - total risk adjusted (real 2022)",{"$f":"SUMIF($B$17:$B$71,$B4,C$17:C$71)","v":3578963.3307498982},{"$f":"SUMIF($B$17:$B$71,$B4,D$17:D$71)","v":24759852.271420963},{"$f":"SUMIF($B$17:$B$71,$B4,E$17:E$71)","v":71207293.786039576},93805188.482232019,83977710.797391579,37656360.790578797,11797936.598328581,{"$f":"SUMIF($B$17:$B$71,$B4,J$17:J$61)","v":0},{"$f":"SUM(C4:J4)","v":326783306.05674142},null,"Capex - total risk adjusted (real 2022)",4767755.0652724132,31733877.04916602,65204288.619170494,86914789.587054521,77350414.875201628,49014244.262547739,11797936.598328581,0,326783306.05674142]
[null,"Inflation",{"$f":"SUMIF($B$17:$B$71,$B5,C$17:C$61)","v":54361.561752949579},1085366.1829974079,6588919.0642611431,11238786.503830388,12864772.881567784,6587651.6790838847,2297241.3829207504,0,{"$f":"SUM(C5:J5)","v":40717099.256414309},null,"Inflation",71333.672272768628,1465757.4166594611,5877082.0027788747,10386826.345032185,11831213.970702279,8533140.4430911522,2297241.3829207504,0,40462595.233457468]
[null,"Capex - total risk adjusted (nominal)",3633324.8925028481,25845218.454418376,77796212.850300714,105043974.98606242,96842483.67895937,44244012.469662681,14095177.981249332,0,{"$f":"SUM(C6:J6)","v":367500405.31315571},null,"Capex - total risk adjusted (nominal)",4839088.7375451811,33199634.465825483,71081370.62194939,97301615.932086706,89181628.845903903,57547384.705638893,14095177.981249332,0,367245901.29019892]
[null,"Interest during construction (IDC)",15848.638373278831,375299.28685579926,1540834.1392899472,3366725.2097536186,10641779.945437323,6736786.895494787,2707802.4254752798,0,{"$f":"SUM(C7:J7)","v":25385076.540680032},null,"Interest during construction (IDC)",21590.803934520547,500528.8216659262,1180757.8783767954,3046418.195447735,9648832.5367131624,8682921.6381974034,2707802.4254752798,0,25788852.299810823]
[null,"Major Capex Allowance",3649173.5308761266,26220517.741274174,79337046.98959066,108410700.19581605,107484263.62439668,50980799.36515747,16802980.406724613,0,{"$f":"SUM(C8:J8)","v":392885481.85383582},null,"Major Capex Allowance",4860679.5414797021,33700163.287491411,72262128.500326172,100348034.12753443,98830461.382617071,66230306.343836293,16802980.406724613,0,393034753.59000969]
{"$rows_left_out":72}
{"sheet":"MCA - costs split","index":4,"n_rows":32,"n_cols":46,"rows_kept":32,"cut":false,"hidden":false,"merged":[[1,44,2,44],[1,45,2,45],[1,2,1,7],[1,33,2,33],[1,34,1,38],[1,39,1,42]]}
[null,null,"Macro dumped",null,null,null,null,null,null,null,null,null,null,null,null,null,null,null,null,null,null,"Macro dumped",null,null,null,null,null,null,null,null,null,null,null,"calculated - table included in MCA documents (includes support and preparedness projects $13.7M)"]
[null,null,"NZGP Projects Cost Estimates, P50, Inflation and IDC ",null,null,null,null,null,null,null,null,null,null,null,null,null,null,null,"Checking",null,null,null,null,null,null,null,null,null,null,null,null,null,null,null,"Central North Island",null,null,null,null,"Wairakei Ring",null,null,null,"HVDC","Preparedness Projects","NZGP"]
[null,null,null,"Real 2022","Inflation","Nominal","IDC","Major Capex Allowance",null,"Low","P50","High",null,"Mode",null,"start","end",null,"mode input","diffference",null,null,0,0,0,0,69999.993000000002,0,0,0,0,"NZGP",null,null,"Lines - BPE-TKU-A&B TTU","Lines - TKU-WKM TTU","Lines - TKU-WKM-AB Duplexing NZ","Subs - BPE-TKU-WKM 1&2 Uprating","CNI Supporting Projects","Lines - WRK-WKM-C TTU","Lines - EDG-KAW-3 TTU","Subs - WRK-THI-WKM 1&1 Uprating","Subs - EDG-KAW Uprating","Subs - HVDC Capacity Stage 1",null,"NZGP"]
[null,null,"Lines - BPE-TKU-A&B TTU",68147300.831813648,9020350.5813719425,77167651.413185596,4412355.8365300326,81580007.249715626,null,60809695.239741698,68147300.831813648,78699507.422223061,null,66233851.649259359,null,"2024-09-02","2026-12-31",null,{"$f":"'Lines - BPE-TKU-A&B TTU'!C18","v":66233851.649259359},{"$f":"N4-S4","v":0},null,"Investigation",null,null,null,null,null,null,null,null,null,{"$f":"SUM(W4:AE4)","v":0},null,"Investigation",{"$f":"W4/1000","v":0},{"$f":"X4/1000","v":0},{"$f":"Y4/1000","v":0},{"$f":"Z4/1000","v":0},null,{"$f":"AA4/1000","v":0},{"$f":"AB4/1000","v":0},{"$f":"AC4/1000","v":0},{"$f":"AD4/1000","v":0},{"$f":"AE4/1000","v":0},null,{"$f":"SUM(AI4:AS4)","v":0}]
[null,null,"Lines - TKU-WKM TTU",27970657.979619779,1819937.1447840878,29790595.124403868,995731.15984584321,30786326.284249712,null,25809721.979895789,27970657.979619779,30629306.935287118,null,27690909.492345132,null,"2022-11-01","2024-12-31",null,{"$f":"'Lines - TKU-WKM TTU'!C24","v":27690909.492345136},0,null,null,0,0,0,0,0,0,0,0,10018671.218370307]
[null,null,"Lines - TKU-WKM-AB Duplexing NZ",94383492.786628649,14284674.021695957,108668166.80832461,10716443.449387614,119384610.25771222,null,81762530.788616747,94383492.786628649,112565919.93824723,null,90904459.41521351,null,"2024-09-01","2028-06-30",null,{"$f":"'Lines - TKU-WKM-AB Duplexing NZ'!C25","v":90904459.415213525},0,null,"Civil Works",0,0,0,0,0,0,0,0,36378807.015606456,36378807.015606456,null,"Civil Works",{"$f":"W6/1000","v":0},{"$f":"X6/1000","v":0},{"$f":"Y6/1000","v":0},{"$f":"Z6/1000","v":0},null,{"$f":"AA6/1000","v":0},{"$f":"AB6/1000","v":0},{"$f":"AC6/1000","v":0},{"$f":"AD6/1000","v":0},{"$f":"AE6/1000","v":36378.807015606457},null,{"$f":"SUM(AI6:AS6)","v":36378.807015606457}]
[null,null,"Subs - BPE-TKU-WKM 1&2 Uprating",17506797.280579872,2020209.7235624555,19527007.004142329,1449738.7461120943,20976745.750254422,null,13692402.277304828,17506797.280579872,20818478.169467166,null,17775886.50093263,null,"2023-09-01","2026-12-31",null,{"$f":"'Subs - BPE-TKU-WKM 1&2 Uprating'!C20","v":17775886.50093263},0,null,"Primary Plant 220 kV - Statcom",0,0,0,10139836.330579877,0,0,5123910.1923969164,191488.81251774466,8984483.1641097534,24439718.499604292,null,"Primary Plant 220 kV - Statcom",0,0,0,10139.836330579878,null,0,0,5123.9101923969165,191.48881251774466,8984.4831641097535,null,24439.718499604292]
[null,null,"Lines - WRK-WKM-C TTU",2877787.1508783475,219064.1128946094,3096851.263772957,167785.82968773751,3264637.0934606944,null,2477039.3189624031,2877787.1508783475,3416811.6664962289,null,2788541.1711666617,null,"2022-09-01","2025-12-31",null,{"$f":"'Lines - WRK-WKM-C TTU'!C27","v":2788541.1711666617},0,null,"Primary Plant 220 kV - other",0,0,0,0,0,0,0,0,368664.18757221347,368664.18757221347,null,"Primary Plant 220 kV - other",0,0,0,0,null,0,0,0,0,368.66418757221345,null,368.66418757221345]
{"$rows_left_out":25}
{"sheet":"Outputs - NEW","index":5,"n_rows":54,"n_cols":14,"rows_kept":54,"cut":false,"hidden":false,"merged":[[47,5,47,7],[1,2,2,2],[47,4,48,4],[1,4,2,4],[3,2,3,5],[4,2,4,3],[4,4,4,5],[4,7,4,8]]}
[]
[null,null,"Capex, $000, P50","Lines","Capex, $000, P50","Substations"]
[null,null,null,"Real 2022",null,"Real 2022"]
[null,null,{"$f":"'Assumptions - with Mode added'!C3","v":"Subs - HVDC Capacity Stage 1"}]
[null,null,"Lines Project",null,"Substation Project",null,null,"Project Costs","Combined"]
[null,null,{"$f":"'Calculations - NEW'!B40","v":"Investigation "},{"$f":"'Calculations - NEW'!F40","v":0},"Investigation",{"$f":"'Calculations - NEW'!F57","v":0},null,"Investigation",{"$f":"D6+F6","v":0}]
[]
[null,null,null,null,"Civil Works",{"$f":"'Calculations - NEW'!F59","v":10018671.218370307},null,"Civil Works",{"$f":"D8+F8","v":10018671.218370307}]
{"$rows_left_out":47}
{"sheet":"Calculations - NEW","index":6,"n_rows":152,"n_cols":48,"rows_kept":152,"cut":false,"hidden":false,"merged":[]}
[null,null,"linked","calculated","blank","hardcoded"]
[null,null,null,null,null,"Total costs",null,"Annual costs (financial year ended 30 June) (summary)",null,null,null,null,null,null,null,null,"Quarterly costs (calculations)"]
[null,null,null,null,null,null,null,null,null,null,null,null,null,null,null,null,"2022-03-30",{"$f":"+EOMONTH(Q3,3)","v":"2022-06-30"},{"$f":"+EOMONTH(R3,3)","v":"2022-09-30"},{"$f":"+EOMONTH(S3,3)","v":"2022-12-31"},{"$f":"+EOMONTH(T3,3)","v":"2023-03-31"},"2023-06-30","2023-09-30","2023-12-31","2024-03-31","2024-06-30","2024-09-30","2024-12-31","2025-03-31","2025-06-30","2025-09-30","2025-12-31","2026-03-31","2026-06-30","2026-09-30","2026-12-31","2027-03-31","2027-06-30","2027-09-30","2027-12-31",{"$f":"+EOMONTH(AN3,3)","v":"2028-03-31"},"2028-06-30","2028-09-30","2028-12-31","2029-03-31","2029-06-30","2029-09-30","2029-12-31"]
[null,null,null,null,null,null,null,2022,2023,2024,2025,2026,2027,2028,2029,null,2022,2022,2022,2022,{"$f":"+Q4+1","v":2023},{"$f":"+R4+1","v":2023},2023,2023,2024,2024,2024,2024,2025,2025,2025,2025,2026,2026,2026,2026,2027,2027,2027,2027,{"$f":"+AK4+1","v":2028},2028,2028,2028,2029,2029,2029,2029]
["Timing Flags",null,null,"Start","Finish"]
[]
[null,"Lines Component",null,null,null,null,"Subs Component"]
[null,"Investigation ",null,{"$f":"IF(Type=\"Lines\",'Assumptions - with Mode added'!D8,\"\")","v":""},{"$f":"IF(Type=\"Lines\",'Assumptions - with Mode added'!E8,\"\")","v":""},null,"Investigation",null,{"$f":"IF(Type=\"Subs\",'Assumptions - with Mode added'!I8,\"\")","v":"2022-01-01"},{"$f":"IF(Type=\"Subs\",'Assumptions - with Mode added'!J8,\"\")","v":"2022-12-01"},null,null,null,null,null,null,{"$f":"+IF(Type=\"Lines\",IF(OR(Q$3<$D8,P$3>=$E8),0,1),IF(OR(Q$3<$I8,P$3>=$J8),0,1))","v":1},1,1,1,0,0,0,0,0,0,0,0,0,0,0,0,0,0,0,0,0,0,0,0,0,0,0,0,0,0,0,0]
{"$rows_left_out":145}
{"sheet":"Assumptions - with Mode added","index":7,"n_rows":97,"n_cols":21,"rows_kept":97,"cut":false,"hidden":false,"merged":[]}
[null,null,null,"input","calculated","linked"]
[]
[null,"Select Project","Subs - HVDC Capacity Stage 1",null,null,null,"Type: ",{"$f":"IF(LEFT(C3,1)=\"S\",\"Subs\",\"Lines\")","v":"Subs"},null,{"$f":"SUM(Q40:Q83)","v":80586773.687585592}]
[]
["Cost phasing",null,null,"Start","Finish"]
[null,null,null,{"$f":"IF('NZGP project list'!D2=\"Original\",OFFSET('NZGP project list'!$F$4,MATCH(C3,'NZGP project list'!$C$5:$C$13,0),0),OFFSET('NZGP project list'!$H$4,MATCH(C3,'NZGP project list'!$C$5:$C$13,0),0))","v":"2024-07-01"},{"$f":"IF('NZGP project list'!D2=\"Original\",OFFSET('NZGP project list'!$G$4,MATCH(C3,'NZGP project list'!$C$5:$C$13,0),0),OFFSET('NZGP project list'!$I$4,MATCH(C3,'NZGP project list'!$C$5:$C$13,0),0))","v":"2027-05-31"}]
[null,"Lines",null,null,null,null,"Subs"]
[null,"Investigation ",null,{"$f":"IF(Type=\"Lines\",DATEVALUE(\"Jan-22\"),\"\")","v":""},{"$f":"IF(Type=\"Lines\",DATEVALUE(\"Dec-22\"),\"\")","v":""},null,"Investigation",null,{"$f":"IF(Type=\"Subs\",DATEVALUE(\"Jan-22\"),\"\")","v":"2022-01-01"},{"$f":"IF(Type=\"Subs\",DATEVALUE(\"Dec-22\"),\"\")","v":"2022-12-01"}]
{"$rows_left_out":90}
{"sheet":"Lines - BPE-TKU-A&B TTU","index":8,"n_rows":32,"n_cols":11,"rows_kept":32,"cut":false,"hidden":false,"merged":[]}
["Project Build start","2024-09-02",null,null,null,null,null,"1900-01-23"]
["Project Build end","2027-06-30",null,null,null,null,null,"2027-06-30"]
[]
[null,null,"Data",null,null,null,null,"Earlier version with different RISK cost"]
["MCA Category ","Category","Sum of Mode Cost","Sum of Low Cost Combined","Sum of High Cost Combined",null,null,"MCA Category ","Sum of Low Cost Combined","Sum of High Cost Combined","Sum of Mode Cost"]
["Community Care Fund","Community Contribution",295333,295333,295333,null,null,"Community Care Fund",295333,295333,295333]
["Construction work","Construction Work",43555546.237027727,38745923.707011178,55063939.481423773,null,null,"Construction Work",38745923.707013384,55063939.481426083,43555546.237029932]
["Contractor overheads","Contractor overheads",8692343.1383999996,8431572.8442480005,9126960.2953200005,null,null,"Contractor overheads",8431572.8442480005,9126960.2953200005,8692343.1383999996]
{"$rows_left_out":25}
{"sheet":"Lines - TKU-WKM TTU","index":9,"n_rows":49,"n_cols":16,"rows_kept":49,"cut":false,"hidden":false,"merged":[]}
["Project Build start","2022-11-01",null,null,null,null,null,null,"2022-11-01"]
["Project Build end","2024-06-30",null,null,null,null,null,null,"2024-06-30"]
[]
[null,"Row Labels","Sum of Mode Cost","Sum of Low Cost Combined","Sum of High Cost Combined",null,null,null,"Row Labels","Sum of Mode Cost","Sum of Low Cost Combined","Sum of High Cost Combined"]
["Community Care Fund","Community Care Fund",69794.100000000006,69794.100000000006,69794.100000000006,null,null,null,null,0,0,0]
["Transpower overheads","Consultants Support during Construction / Tendering",197500,181700,203425,null,null,"Community Care Fund","Community Care Fund",69794.100000000006,69794.100000000006,69794.100000000006,null,null,null,"2022-11-01"]
["Contractor overheads","Contractor Safety Compliance & QA Costs",150000,147000,156000,null,null,"Transpower overheads","Consultants Support during Construction / Tendering",197500,181700,203425,null,null,null,"2024-06-30"]
["Contractor overheads","Contractor's Establishment and Disestablishment",500000,490000,520000,null,null,"Contractor overheads","Contractor Safety Compliance & QA Costs",150000,147000,156000]
{"$rows_left_out":42}
{"sheet":"Lines - TKU-WKM-AB Duplexing NZ","index":10,"n_rows":32,"n_cols":11,"rows_kept":32,"cut":false,"hidden":false,"merged":[[0,5,0,9],[1,5,1,12]]}
["Project Build start","2024-09-01",null,null,null,"2024-09-02"]
["Project Build end","2028-06-30",null,null,null,"2028-06-30"]
[]
[null,"Row Labels","Sum of Mode Cost","Sum of Low Cost Combined","Sum of High Cost Combined",null,"MCA Category","TEES Category","Mode","Low","High"]
["Community Care Fund","Community Care Fund",379496,379496,379496,null,"Community Care Fund","Community Contribution",405103,405103,405103]
["Transpower overheads","Consultants Support during Construction / Tendering",497499.47875000001,482574.49438749999,517399.45789999998,null,"Design","Design Allowance",2999999.7,2999999.7,2999999.7]
["Contractor overheads","Contractor Safety Compliance & QA Costs",200000,160000,220000.00000000003,null,"Freight","Freight on Materials",561506.5,561506.5,561506.5]
["Contractor overheads","Contractor's Establishment and Disestablishment",2150000,1720000,2365000,null,"Construction work","Lines",56150745.53453505,49418810.041147374,77355179.911374047]
{"$rows_left_out":25}
{"sheet":"Lines - WRK-WKM-C TTU","index":11,"n_rows":27,"n_cols":11,"rows_kept":27,"cut":false,"hidden":false,"merged":[]}
["Project Build start","2022-09-01"]
["Project Build end","2024-06-30"]
[]
["MCA Category","Row Labels","Sum of Cost","Sum of Low Cost Combined","Sum of High Cost Combined",null,null,"Row Labels","Sum of Mode Cost","Sum of Low Cost Combined","Sum of High Cost Combined"]
["Stakeholder costs","Community/Stakeholder  Engagement",50000,25000,75000,null,null,"Community Care Fund",405103,405103,405103]
["Transpower Overheads","Consultants Support during Construction / Tendering",72792.018617229158,72792.018617229158,72792.018617229158,null,null,"Consultants Support during Construction / Tendering",497499.47875000001,482574.49438749999,517399.45789999998]
["Contractor Overheads","Contractor Safety Compliance & QA Costs",62229.422805529379,49783.538244423507,93344.134208294068,null,null,"Contractor Safety Compliance & QA Costs",200000,160000,220000.00000000003]
["Contractor Overheads","Contractor's Establishment and Disestablishment",48538.949788312901,38831.159830650329,72808.424682469369,null,null,"Contractor's Establishment and Disestablishment",2150000,1720000,2365000]
{"$rows_left_out":20}
{"sheet":"Lines - EDG-KAW-3 TTU","index":12,"n_rows":20,"n_cols":12,"rows_kept":20,"cut":false,"hidden":false,"merged":[[0,8,0,12],[1,8,1,15]]}
["Project Build start","2023-09-01",null,null,null,null,null,null,"2023-09-01"]
["Project Build end","2024-06-30",null,null,null,null,null,null,"2024-06-30"]
[null,null,null,null,null,null,null,null,"Pivot Table dump from "]
["MCA Category","TEES Category","Sum of Mode Cost","Sum of Low Cost Combined","Sum of High Cost Combined",null,null,null,"Row Labels","Sum of Mode Cost","Sum of Low Cost Combined","Sum of High Cost Combined"]
["Category","Category",null,0,0,null,null,null,"Category",null,0,0]
["Community Care Fund","Community Care Fund (CCF)",36000,36000,360000,null,null,null,"Community Care Fund (CCF)",36000,36000,36000]
["Stakeholder costs","Community Contribution",170000,85000,215000,null,null,null,"Community Contribution",170000,85000,215000]
["Construction Work","Construction Work",5101016.9121256387,4817769.6978056384,6013653.0299204858,null,null,null,"Construction Work",5101016.9121256387,4813809.6978056384,6054891.8047204856]
{"$rows_left_out":13}
{"sheet":"Subs - BPE-TKU-WKM 1&2 Uprating","index":13,"n_rows":20,"n_cols":14,"rows_kept":20,"cut":false,"hidden":false,"merged":[[0,7,0,11],[1,7,1,14]]}
["Project Build start","2023-09-01",null,null,null,null,null,"2023-09-01"]
["Project Build end","2026-06-30",null,null,null,null,null,"2026-06-30"]
[]
[]
[null,"Sub-category","Total","Sum of Low Cost Combined","Sum of High Cost Combined"]
["Community Care Fund","Community Care Fund",66632.95,66632.95,66632.95]
["Contractor overheads","Consultants Support during Construction / Tendering",242500,242500,242500]
["Contractor overheads","Contractor Safety Compliance & QA Costs",50000,50000,50000]
{"$rows_left_out":13}
{"sheet":"Subs - WRK-THI-WKM 1&1 Uprating","index":14,"n_rows":20,"n_cols":9,"rows_kept":20,"cut":false,"hidden":false,"merged":[[2,6,2,12],[0,7,0,11],[1,7,1,14]]}
["Project Build start","2023-09-01",null,null,null,null,"30612 - WRK-THI-WKM 1&1 Uprating A3","2023-09-01"]
["Project Build end","2025-06-30",null,null,null,null,null,"2025-06-30"]
[]
[]
[null,null,null,null,null,null,"include uncertainty range","Yes","Yes"]
[null,"Row Labels","Sum of Total","Sum of Low - Cost","Sum of High - Cost"]
["Design","Design Allowance",570000,570000,570000]
["Transpower Overheads","Consultants Support during Construction / Tendering",167710,167710,167710]
{"$rows_left_out":13}
{"sheet":"Subs - EDG-KAW Uprating","index":15,"n_rows":20,"n_cols":9,"rows_kept":20,"cut":false,"hidden":false,"merged":[[0,3,0,9],[1,3,1,9]]}
["Project Build start","2023-09-01"]
["Project Build end","2025-09-30"]
[]
[]
["Reporting Level","Row Labels","Sum of Cost","Low","High",null,"include uncertainty range","Yes","Yes"]
["Transpower overheads","Consultants Support during Construction / Tendering",14675,14675,14675]
["Contractor overheads","Contractor Safety Compliance & QA Costs",3000,3000,3000]
["Contractor overheads","Contractor's Establishment and Disestablishment",18000,18000,18000]
{"$rows_left_out":13}
{"sheet":"Subs - HVDC Capacity Stage 1","index":16,"n_rows":28,"n_cols":16,"rows_kept":28,"cut":false,"hidden":false,"merged":[]}
["Project Build start","2024-07-01"]
["Project Build end","2027-05-31"]
[]
["MCA Category","TEES Category","Mode","Low","High",null,null,null,"Low","Mode","High",null,null,"Low","Mode","High"]
["Civil Works","Civil Works",8643294.8469999991,8643294.8469999991,13339123.507499998,null,null,"Civil Works",8643294.8469999991,8643294.8469999991,13339123.507499998,null,"Civil Works",8643294.8469999991,8643294.8469999991,13339123.507499998]
["Primary Plant 220 kV - Statcom","Primary Plant 220 kV - Statcom",36305770.649999999,36305770.649999999,36555132.399999999,null,null,"Primary Plant 220 kV - Statcom",36305770.649999999,36305770.649999999,36555132.399999999,null,"Primary Plant 220 kV - Statcom",36305770.649999999,36305770.649999999,36555132.399999999]
["Primary Plant 220 kV - Other","Primary Plant 220 kV - Other",8586088.1750000007,8586088.1750000007,9946293.75,null,null,"Primary Plant 220 kV - Other",8586088.1750000007,8586088.1750000007,9946293.75,null,"Primary Plant 220 kV - Other",8586088.1750000007,8586088.1750000007,9946293.75]
["Cables","Cables",340047.66901919997,340047.66901919997,437750.57477079995,null,null,"Cables",340047.66901919997,340047.66901919997,437750.57477079995,null,"Cables",340047.66901919997,340047.66901919997,437750.57477079995]
{"$rows_left_out":20}