{"text_format":"1","workbook":"xlsx","n_sheets":6,"sheets":["Pricing CoverSheet","TOC","Guidelines","S18.Total revenue requirement","S19 Pricing Asset Revenue","S20.Demand Forecast"],"not_rendered":{"charts":0,"images":3,"macros":1,"external_links":0,"defined_names":6,"comments":0,"pivot_tables":0},"unopened":[],"bounds":{"document_bytes":16777216,"sheet_cells":100000,"rows_first":2000,"rows_last":500,"rows_between":2000,"halvings":0,"cell_chars":16384,"cell_head_chars":4096},"cells_cut":0,"cells_raw":0,"read":"whole","date_system":"1900"}

{"sheet":"Pricing CoverSheet","index":0,"n_rows":18,"n_cols":3,"rows_kept":18,"cut":false,"hidden":false,"merged":[[13,1,14,1]]}
[]
[]
["Specified Airport Services Information Disclosure Requirements"]
["Information Templates"]
["for"]
["Schedules 18–20"]
[]
[null,"Company Name","Airport Company"]
[]
[null,"Disclosure Date","2017-02-28"]
[]
[null,"Pricing Period Starting Year (year ended)","2018-06-30"]
[]
[null,"Disclosure year of most recent annual disclosure (year ended) ¹","2016-06-30"]
[]
[]
["Templates for Schedules 18–20 (Disclosure Following a Price Setting Event)"]
["Version 4.0.  Prepared [XX] 2019"]

{"sheet":"TOC","index":1,"n_rows":7,"n_cols":3,"rows_kept":7,"cut":false,"hidden":false,"merged":[]}
[]
[null,"Table of Contents"]
[]
[null,"Schedule","Description"]
[null,"18","REPORT ON THE FORECAST TOTAL ASSET BASE REVENUE REQUIREMENTS"]
[null,"19","REPORT ON THE FORECAST PRICING ASSET BASE REVENUE REQUIREMENTS"]
[null,"20","REPORT ON DEMAND FORECASTS"]

{"sheet":"Guidelines","index":2,"n_rows":10,"n_cols":2,"rows_kept":10,"cut":false,"hidden":false,"merged":[[10,1,10,3],[0,1,0,4],[5,1,5,3],[6,1,6,3],[7,1,7,3],[8,1,8,3],[9,1,9,3]]}
[null,"Disclosure Template Guidelines for Information Entry "]
[]
[]
[]
[]
[null,"Templates\nThe templates contained in this workbook are intended to reflect the specified airport disclosure requirements set out in Schedules 18–19 of  Commerce Commission decision 715  (Commerce Act (Specified Airport Services Information Disclosure) Determination 2010). "]
[null,"Data entry cells and calculated cells\nData entered into this workbook may be entered only into the data entry cells.  Data entry cells are the bordered, unshaded areas in each template.  Under no circumstances should data be entered into the workbook outside a data entry cell.\nIn some cases, where the information for disclosure is able to be ascertained from disclosures elsewhere in the workbook, such information is disclosed in a calculated cell.  Under no circumstances should the formulas in a calculated cell be overwritten.    All cells that are not data entry cells may be locked using worksheet protection to ensure they are not overwritten."]
[null,"Validation settings on data entry cells\nTo maintain a consistency of format and to guard against errors in data entry, some data entry cells test entries for validity and accept only a limited range of values.  For example, entries may be limited to a list of category names or to values between 0% and 100%."]
[null,"Data entry cells for text entries\nData input cells that display the data validation input message \"Short text entry cell\" have a maximum text length of 253 characters.  Because of page layout constraints, this text length is unlikely to be approached .  The amount of text that may be entered in the comment boxes is restricted only by the capacity of the spreadsheet program and page layout constraints.  Should a comment box within a template be inadequate to fully present the disclosed comments, comments may be continued outside the template.  The comment box  must then contain a reference to identify where in the disclosure the comment is continued.\nRow widths can be adjusted to increase the viewable size of text entries. \nA paragraph feed may be inserted in an entry cell by holding down both the {alt} and the {shift} keys."]
[null,"Data entry cells that contain conditional formatting\nA limited number of data entry cells may change colour or disappear from view in response to data entries (including date entries) made in the workbook.  This feature has been implemented to highlight data being entered that is not internally consistent with other data currently entered, and to hide data entry cells for conditionally disclosed information when the determination does not require the data be disclosed. \na) Internal consistency checks\nTo assist with data entry, the shading of the following data entry cells will change if the cell content becomes inconsistent with data elsewhere in the template:\n   Internal consistency checking is not applied in Schedules 18–24.\n"]

{"sheet":"S18.Total revenue requirement","index":3,"n_rows":320,"n_cols":29,"rows_kept":320,"cut":false,"hidden":false,"merged":[[40,8,40,11],[54,6,54,15],[56,2,56,15],[43,8,43,15],[46,2,48,15],[6,11,6,12],[7,11,7,12],[6,13,6,14],[7,13,7,14],[7,5,7,6],[6,5,6,6],[6,7,6,8],[7,7,7,8],[6,9,6,10],[7,9,7,10],[57,2,59,15],[51,6,51,15],[52,6,52,15],[53,6,53,15],[127,7,127,9],[182,2,184,9],[188,11,188,14],[152,2,154,9],[50,6,50,11],[1,12,1,15],[2,12,2,15],[41,8,41,15],[42,8,42,15],[160,2,160,8],[126,7,126,9],[75,2,75,11],[107,2,109,11],[115,2,122,11],[63,9,63,11],[64,9,64,11],[78,2,85,11],[311,2,318,9],[253,2,253,9],[281,6,281,9],[255,2,267,9],[268,2,268,9],[310,2,310,9],[235,6,235,9],[236,6,236,9],[240,2,252,9],[280,6,280,9],[189,11,189,14]]}
[]
[null,null,null,null,null,null,null,null,null,null,null,null,{"$f":"IF(NOT(ISBLANK('Pricing CoverSheet'!$C$8)),'Pricing CoverSheet'!$C$8,\"\")","v":"Airport Company"}]
[null,null,null,null,null,null,null,null,null,null,null,null,{"$f":"IF(ISNUMBER('Pricing CoverSheet'!$C$12),'Pricing CoverSheet'!$C$12,\"\")","v":"2018-06-30"}]
["SCHEDULE 18: REPORT ON THE FORECAST TOTAL ASSET BASE REVENUE REQUIREMENTS"]
["ref","Version 4.0 [DRAFT]"]
[]
[null,null,null,null,"First Day of Pricing Period","Pricing Period Starting Year",null,"Pricing Period Starting Year + 1",null,"Pricing Period Starting Year + 2",null,"Pricing Period Starting Year + 3",null,"Pricing Period Starting Year + 4",null,"Last Day of Pricing Period",null,null,"Calculation - Annual IRR "]
[{"$f":"ROW()","v":8},"18(i): Forecast Internal Rate of Return",null,null,null,{"$f":"IF(ISNUMBER('Pricing CoverSheet'!$C$12),DATE(YEAR('Pricing CoverSheet'!$C$12),MONTH('Pricing CoverSheet'!$C$12),DAY('Pricing CoverSheet'!$C$12)),\"\")","v":"2018-06-30"},null,{"$f":"IF(ISNUMBER('Pricing CoverSheet'!$C$12),DATE(YEAR('Pricing CoverSheet'!$C$12)+1,MONTH('Pricing CoverSheet'!$C$12),DAY('Pricing CoverSheet'!$C$12)),\"\")","v":"2019-06-30"},null,{"$f":"IF(ISNUMBER('Pricing CoverSheet'!$C$12),DATE(YEAR('Pricing CoverSheet'!$C$12)+2,MONTH('Pricing CoverSheet'!$C$12),DAY('Pricing CoverSheet'!$C$12)),\"\")","v":"2020-06-30"},null,{"$f":"IF(ISNUMBER('Pricing CoverSheet'!$C$12),DATE(YEAR('Pricing CoverSheet'!$C$12)+3,MONTH('Pricing CoverSheet'!$C$12),DAY('Pricing CoverSheet'!$C$12)),\"\")","v":"2021-06-30"},null,{"$f":"IF(ISNUMBER('Pricing CoverSheet'!$C$12),DATE(YEAR('Pricing CoverSheet'!$C$12)+4,MONTH('Pricing CoverSheet'!$C$12),DAY('Pricing CoverSheet'!$C$12)),\"\")","v":"2022-06-30"},null,null,null,null,null,{"$f":"G31","v":"2018-06-30"},null,{"$f":"H31","v":"2019-06-30"},null,{"$f":"I31","v":"2020-06-30"},null,{"$f":"J31","v":"2021-06-30"},null,{"$f":"K31","v":"2022-06-30"}]
[{"$f":"ROW()","v":9},null,"($000)","Cash flow date",{"$f":"E71","v":"2017-07-01"},{"$f":"M3-IF(ISNUMBER(E74),E74,F74)","v":"2017-12-30"},{"$f":"$M$3-IF(ISNUMBER(E73),E73,F73)","v":"2018-02-02"},{"$f":"EOMONTH($M$3,12)-IF(ISNUMBER(E74),E74,F74)","v":"2018-12-30"},{"$f":"EOMONTH($M$3,12)-IF(ISNUMBER(E73),E73,F73)","v":"2019-02-02"},{"$f":"EOMONTH($M$3,24)-IF(ISNUMBER(E74),E74,F74)","v":"2019-12-31"},{"$f":"EOMONTH($M$3,24)-IF(ISNUMBER(E73),E73,F73)","v":"2020-02-03"},{"$f":"EOMONTH($M$3,36)-IF(ISNUMBER(D73),E74,F74)","v":"2020-12-30"},{"$f":"EOMONTH($M$3,36)-IF(ISNUMBER(E73),E73,F73)","v":"2021-02-02"},{"$f":"EOMONTH($M$3,48)-IF(ISNUMBER(K74),E74,F74)","v":"2021-12-30"},{"$f":"EOMONTH($M$3,48)-IF(ISNUMBER(E73),E73,F73)","v":"2022-02-02"},{"$f":"EOMONTH($M$3,48)","v":"2022-06-30"},null,null,null,"Date","Cash flow","Date","Cash flow","Date","Cash flow","Date","Cash flow","Date","Cash flow"]
[{"$f":"ROW()","v":10},null,"Opening RAB",null,{"$f":"E140","v":0},null,null,null,null,null,null,null,null,null,null,null,null,null,null,{"$f":"$E$9","v":"2017-07-01"},{"$f":"$E$24","v":0},{"$f":"$T$13+1","v":"2018-07-01"},{"$f":"-$U$13","v":0},{"$f":"$V$13+1","v":"2019-07-01"},{"$f":"-$W$13","v":0},{"$f":"$X$13+1","v":"2020-07-01"},{"$f":"-$Y$13","v":0},{"$f":"$Z$13+1","v":"2021-07-01"},{"$f":"-$AA$13","v":0}]
[{"$f":"ROW()","v":11},null,"Forecast opening carry forward adjustment",null,{"$f":"G45","v":0},null,null,null,null,null,null,null,null,null,null,null,null,null,null,{"$f":"$F$9","v":"2017-12-30"},{"$f":"$F$24","v":0},{"$f":"$H$9","v":"2018-12-30"},{"$f":"$H$24","v":0},{"$f":"$J$9","v":"2019-12-31"},{"$f":"$J$24","v":0},{"$f":"$L$9","v":"2020-12-30"},{"$f":"$L$24","v":0},{"$f":"$N$9","v":"2021-12-30"},{"$f":"$N$24","v":0}]
[{"$f":"ROW()","v":12},null,"Opening investment value",null,{"$f":"E10-E11","v":0},null,null,null,null,null,null,null,null,null,null,null,null,null,null,{"$f":"$G$9","v":"2018-02-02"},{"$f":"$G$24","v":0},{"$f":"$I$9","v":"2019-02-02"},{"$f":"$I$24","v":0},{"$f":"$K$9","v":"2020-02-03"},{"$f":"$K$24","v":0},{"$f":"$M$9","v":"2021-02-02"},{"$f":"$M$24","v":0},{"$f":"$O$9","v":"2022-02-02"},{"$f":"$O$24","v":0}]
[{"$f":"ROW()","v":13},null,null,null,null,null,null,null,null,null,null,null,null,null,null,null,null,null,null,{"$f":"$T$8","v":"2018-06-30"},{"$f":"$G$35","v":0},{"$f":"$V$8","v":"2019-06-30"},{"$f":"$H$35","v":0},{"$f":"$X$8","v":"2020-06-30"},{"$f":"$I$35","v":0},{"$f":"$Z$8","v":"2021-06-30"},{"$f":"$J$35","v":0},{"$f":"$AB$8","v":"2022-06-30"},{"$f":"$K$35","v":0}]
[{"$f":"ROW()","v":14},"plus","Forecast total revenue requirement",null,null,null,{"$f":"H92","v":0},null,{"$f":"I92","v":0},null,{"$f":"J92","v":0},null,{"$f":"K92","v":0},null,{"$f":"L92","v":0}]
["amended","less","Forecast assets commissioned",null,null,{"$f":"F147","v":0},null,{"$f":"G147","v":0},null,{"$f":"H147","v":0},null,{"$f":"I147","v":0},null,{"$f":"J147","v":0}]
[{"$f":"ROW()","v":16},"plus","Forecast cash flow from asset disposals",null,null,null,null,null,null,null,null,null,null,null,null,null,null,null,"Forecast post-tax IRR - annual",null,{"$f":"IFERROR(XIRR(U10:U13,T10:T13,7%),\"\")","v":""},null,{"$f":"IFERROR(XIRR(W10:W13,V10:V13,7%),\"\")","v":""},null,{"$f":"IFERROR(XIRR(Y10:Y13,X10:X13,7%),\"\")","v":""},null,{"$f":"IFERROR(XIRR(AA10:AA13,Z10:Z13,7%),\"\")","v":""},null,{"$f":"IFERROR(XIRR(AC10:AC13,AB10:AB13,7%),\"\")","v":""}]
["amended","less","Forecast operational expenditure ",null,null,{"$f":"H94","v":0},null,{"$f":"I94","v":0},null,{"$f":"J94","v":0},null,{"$f":"K94","v":0},null,{"$f":"L94","v":0}]
["amended","less","Forecast unlevered tax",null,null,{"$f":"H96","v":0},null,{"$f":"I96","v":0},null,{"$f":"J96","v":0},null,{"$f":"K96","v":0},null,{"$f":"L96","v":0}]
[{"$f":"ROW()","v":19}]
[{"$f":"ROW()","v":20},null,"Forecast closing asset base",null,null,null,null,null,null,null,null,null,null,null,null,{"$f":"J150","v":0},null,null,"Calculation -period to date"]
[{"$f":"ROW()","v":21},null,"Forecast closing carry forward adjustment",null,null,null,null,null,null,null,null,null,null,null,null,{"$f":"E56","v":0},null,null,null,{"$f":"T8","v":"2018-06-30"},null,{"$f":"V8","v":"2019-06-30"},null,{"$f":"X8","v":"2020-06-30"},null,{"$f":"Z8","v":"2021-06-30"},null,{"$f":"AB8","v":"2022-06-30"}]
[{"$f":"ROW()","v":22},null,"Forecast closing investment value",null,null,null,null,null,null,null,null,null,null,null,null,{"$f":"P20-P21","v":0},null,null,null,"Date","Cash flow","Date","Cash flow","Date","Cash flow","Date","Cash flow","Date","Cash flow"]
[{"$f":"ROW()","v":23},null,null,null,null,null,null,null,null,null,null,null,null,null,null,null,null,null,null,{"$f":"$E$9","v":"2017-07-01"},{"$f":"$E$24","v":0},{"$f":"T23","v":"2017-07-01"},0,"2017-07-01",0,"2017-07-01",0,"2017-07-01",0]
["amended",null,"Forecast net cash flows",null,{"$f":"-E12","v":0},{"$f":"-F15+F16-F17-F18","v":0},{"$f":"SUM(G14:G18)","v":0},{"$f":"-H15+H16-H17-H18","v":0},0,{"$f":"-J15+J16-J17-J18","v":0},0,{"$f":"-L15+L16-L17-L18","v":0},0,{"$f":"-N15+N16-N17-N18","v":0},0,{"$f":"P22","v":0},null,null,null,{"$f":"$F$9","v":"2017-12-30"},{"$f":"$F$24","v":0},{"$f":"T24","v":"2017-12-30"},{"$f":"U24","v":0},{"$f":"V24","v":"2017-12-30"},{"$f":"W24","v":0},{"$f":"X24","v":"2017-12-30"},{"$f":"Y24","v":0},{"$f":"Z24","v":"2017-12-30"},{"$f":"AA24","v":0}]
[{"$f":"ROW()","v":25},null,null,null,null,null,null,null,null,null,null,null,null,null,null,null,null,null,null,{"$f":"$G$9","v":"2018-02-02"},{"$f":"$G$24","v":0},"2018-02-02",0,"2018-02-02",0,"2018-02-02",0,"2018-02-02",0]
[{"$f":"ROW()","v":26},null,"Forecast post-tax IRR - Pricing period ",null,{"$f":"IFERROR(XIRR(E24:P24,E9:P9,7%),\"\")","v":""},null,null,null,null,null,null,null,null,null,null,null,null,null,null,{"$f":"$T$8","v":"2018-06-30"},{"$f":"$G$35","v":0},{"$f":"H9","v":"2018-12-30"},{"$f":"H24","v":0},"2018-12-30",{"$f":"W26","v":0},"2018-12-30",0,"2018-12-30",0]
[{"$f":"ROW()","v":27},null,"NPV check",null,{"$f":"IFERROR(XNPV(E26,E24:P24,E9:P9),0)","v":0},{"$f":"IF(ABS(E27)<0.01,\"OK\",\"ERROR\")","v":"OK"},null,null,null,null,null,null,null,null,null,null,null,null,null,null,null,{"$f":"I9","v":"2019-02-02"},{"$f":"I24","v":0},{"$f":"V27","v":"2019-02-02"},{"$f":"W27","v":0},{"$f":"X27","v":"2019-02-02"},{"$f":"Y27","v":0},"2019-02-02",0]
["new",null,null,null,null,null,null,null,null,null,null,null,null,null,null,null,null,null,null,null,null,{"$f":"H31","v":"2019-06-30"},{"$f":"H35","v":0},{"$f":"J9","v":"2019-12-31"},{"$f":"J24","v":0},{"$f":"X28","v":"2019-12-31"},{"$f":"Y28","v":0},{"$f":"Z28","v":"2019-12-31"},{"$f":"AA28","v":0}]
["new",null,null,null,null,null,null,null,null,null,null,null,null,null,null,null,null,null,null,null,null,null,null,{"$f":"K9","v":"2020-02-03"},{"$f":"K24","v":0},"2020-02-03",0,{"$f":"Z29","v":"2020-02-03"},{"$f":"AA29","v":0}]
["new","18(ii): Forecast Internal Rate of Return - Annual and Period to Date",null,null,null,null,"Pricing Period Starting Year","Pricing Period Starting Year \n+ 1","Pricing Period Starting Year \n+ 2","Pricing Period Starting Year \n+ 3","Pricing Period Starting Year \n+ 4",null,null,null,null,null,null,null,null,null,null,null,null,{"$f":"I31","v":"2020-06-30"},{"$f":"I35","v":0},{"$f":"L9","v":"2020-12-30"},{"$f":"L24","v":0},"2020-12-30",0]
{"$rows_left_out":291}
{"sheet":"S19 Pricing Asset Revenue","index":4,"n_rows":141,"n_cols":17,"rows_kept":141,"cut":false,"hidden":false,"merged":[[1,12,1,15],[2,12,2,15],[91,2,93,9],[60,8,60,10],[38,6,38,8],[29,8,29,15],[30,8,30,15],[31,8,31,15],[40,6,40,15],[41,6,41,15],[42,6,42,15],[45,2,47,15],[56,2,56,15],[44,2,44,15],[28,8,28,15],[34,2,36,15],[39,6,39,15],[6,5,6,6],[6,7,6,8],[6,9,6,10],[6,11,6,12],[6,13,6,14],[7,5,7,6],[7,7,7,8],[7,9,7,10],[7,11,7,12],[7,13,7,14],[136,2,138,9],[61,8,61,10],[66,2,73,9],[99,2,106,9],[110,7,110,9],[111,7,111,9]]}
[]
[null,null,null,null,null,null,null,null,null,null,null,null,{"$f":"IF(NOT(ISBLANK('Pricing CoverSheet'!$C$8)),'Pricing CoverSheet'!$C$8,\"\")","v":"Airport Company"}]
[null,null,null,null,null,null,null,null,null,null,null,null,{"$f":"IF(ISNUMBER('Pricing CoverSheet'!$C$12),'Pricing CoverSheet'!$C$12,\"\")","v":"2018-06-30"}]
["SCHEDULE 19: REPORT ON THE FORECAST PRICING ASSET BASE REVENUE REQUIREMENTS"]
["ref","Version 4.0 [DRAFT]"]
[]
[null,null,null,null,"First Day of Pricing Period","Pricing Period Starting Year",null,"Pricing Period Starting Year + 1",null,"Pricing Period Starting Year + 2",null,"Pricing Period Starting Year + 3",null,"Pricing Period Starting Year + 4",null,"Last Day of Pricing Period"]
[{"$f":"ROW()","v":8},"19(i): Forecast Internal Rate of Return",null,null,null,{"$f":"IF(ISNUMBER('Pricing CoverSheet'!$C$12),DATE(YEAR('Pricing CoverSheet'!$C$12),MONTH('Pricing CoverSheet'!$C$12),DAY('Pricing CoverSheet'!$C$12)),\"\")","v":"2018-06-30"},null,{"$f":"IF(ISNUMBER('Pricing CoverSheet'!$C$12),DATE(YEAR('Pricing CoverSheet'!$C$12)+1,MONTH('Pricing CoverSheet'!$C$12),DAY('Pricing CoverSheet'!$C$12)),\"\")","v":"2019-06-30"},null,{"$f":"IF(ISNUMBER('Pricing CoverSheet'!$C$12),DATE(YEAR('Pricing CoverSheet'!$C$12)+2,MONTH('Pricing CoverSheet'!$C$12),DAY('Pricing CoverSheet'!$C$12)),\"\")","v":"2020-06-30"},null,{"$f":"IF(ISNUMBER('Pricing CoverSheet'!$C$12),DATE(YEAR('Pricing CoverSheet'!$C$12)+3,MONTH('Pricing CoverSheet'!$C$12),DAY('Pricing CoverSheet'!$C$12)),\"\")","v":"2021-06-30"},null,{"$f":"IF(ISNUMBER('Pricing CoverSheet'!$C$12),DATE(YEAR('Pricing CoverSheet'!$C$12)+4,MONTH('Pricing CoverSheet'!$C$12),DAY('Pricing CoverSheet'!$C$12)),\"\")","v":"2022-06-30"}]
[{"$f":"ROW()","v":9},null,"($000)","Cash flow date",{"$f":"E52","v":"2017-07-01"},{"$f":"M3-IF(ISNUMBER(E55),E55,F55)","v":"2017-12-30"},{"$f":"$M$3-IF(ISNUMBER(E54),E54,F54)","v":"2018-02-02"},{"$f":"EOMONTH($M$3,12)-IF(ISNUMBER(E55),E55,F55)","v":"2018-12-30"},{"$f":"EOMONTH($M$3,12)-IF(ISNUMBER(E54),E54,F54)","v":"2019-02-02"},{"$f":"EOMONTH($M$3,24)-IF(ISNUMBER(E55),E55,F55)","v":"2019-12-31"},{"$f":"EOMONTH($M$3,24)-IF(ISNUMBER(E54),E54,F54)","v":"2020-02-03"},{"$f":"EOMONTH($M$3,36)-IF(ISNUMBER(D54),E55,F55)","v":"2020-12-30"},{"$f":"EOMONTH($M$3,36)-IF(ISNUMBER(E54),E54,F54)","v":"2021-02-02"},{"$f":"EOMONTH($M$3,48)-IF(ISNUMBER(K55),E55,F55)","v":"2021-12-30"},{"$f":"EOMONTH($M$3,48)-IF(ISNUMBER(E54),E54,F54)","v":"2022-02-02"},{"$f":"EOMONTH($M$3,48)","v":"2022-06-30"}]
[{"$f":"ROW()","v":10},null,"Opening asset base (applicable to price setting)",null,{"$f":"F128","v":0}]
[{"$f":"ROW()","v":11},null,"Forecast opening carry forward adjustment",null,{"$f":"G33","v":0}]
[{"$f":"ROW()","v":12},null,"Opening investment value",null,{"$f":"E10-E11","v":0}]
[{"$f":"ROW()","v":13}]
["amended","plus","Forecast revenue for services applicable to price setting event",null,null,null,{"$f":"F80","v":0},null,{"$f":"G80","v":0},null,{"$f":"H80","v":0},null,{"$f":"I80","v":0},null,{"$f":"J80","v":0}]
["amended","less","Forecast assets commissioned",null,null,{"$f":"F131","v":0},null,{"$f":"G131","v":0},null,{"$f":"H131","v":0},null,{"$f":"I131","v":0},null,{"$f":"J131","v":0}]
[{"$f":"ROW()","v":16},"plus","Forecast cash flow from asset disposals"]
["amended","less","Forecast operational expenditure ",null,null,{"$f":"F82","v":0},null,{"$f":"G82","v":0},null,{"$f":"H82","v":0},null,{"$f":"I82","v":0},null,{"$f":"J82","v":0}]
["amended","less","Forecast unlevered tax",null,null,{"$f":"F84","v":0},null,{"$f":"G84","v":0},null,{"$f":"H84","v":0},null,{"$f":"I84","v":0},null,{"$f":"J84","v":0}]
[{"$f":"ROW()","v":19}]
[{"$f":"ROW()","v":20},null,"Forecast closing asset base",null,null,null,null,null,null,null,null,null,null,null,null,{"$f":"J134","v":0}]
[{"$f":"ROW()","v":21},null,"Forecast closing carry forward adjustment",null,null,null,null,null,null,null,null,null,null,null,null,{"$f":"E44","v":0}]
[{"$f":"ROW()","v":22},null,"Forecast closing investment value",null,null,null,null,null,null,null,null,null,null,null,null,{"$f":"P20-P21","v":0}]
[{"$f":"ROW()","v":23}]
["amended",null,"Forecast net cash flows",null,{"$f":"-E12","v":0},{"$f":"-F15+F16-F17-F18","v":0},{"$f":"SUM(G14:G18)","v":0},{"$f":"-H15+H16-H17-H18","v":0},0,{"$f":"-J15+J16-J17-J18","v":0},0,{"$f":"-L15+L16-L17-L18","v":0},0,{"$f":"-N15+N16-N17-N18","v":0},0,{"$f":"P22","v":0}]
[{"$f":"ROW()","v":25}]
[{"$f":"ROW()","v":26},null,{"$f":"\"Forcast post-tax IRR as at \"&TEXT(E9,\"dd mmmm yyy\")","v":"Forcast post-tax IRR as at 01 July 2017"},null,{"$f":"IFERROR(XIRR(E24:P24,E9:P9,7%),\"\")","v":""}]
[{"$f":"ROW()","v":27},null,"NPV check",null,{"$f":"IFERROR(XNPV(E26,E24:P24,E9:P9),0)","v":0},{"$f":"IF(ABS(E27)<0.01,\"OK\",\"ERROR\")","v":"OK"}]
[{"$f":"ROW()","v":28},"19(ii): Opening carry forward adjustment"]
[{"$f":"ROW()","v":29},null,"($000)",null,"Forecast closing carry forward from previous price setting event","Opening carry forward adjustments from current price setting event","Total opening carry forward adjustments",null,"Please explain each adjustment and how this has been calculated"]
[{"$f":"ROW()","v":30},null,"Default revaluation gain/loss adjustment",null,null,null,{"$f":"E30+F30","v":0}]
{"$rows_left_out":112}
{"sheet":"S20.Demand Forecast","index":5,"n_rows":72,"n_cols":25,"rows_kept":72,"cut":false,"hidden":false,"merged":[[49,2,51,2],[44,2,47,2],[39,2,42,2],[57,2,70,23],[30,17,30,23],[36,2,38,2],[53,2,55,2],[1,17,1,23],[2,17,2,23],[8,2,14,2],[8,3,10,3],[12,3,14,3],[29,17,29,23],[16,3,18,3],[20,3,22,3],[16,2,22,2],[23,2,24,2]]}
[]
[null,null,null,null,null,null,null,null,null,null,null,null,null,null,null,null,"Regulated Airport",{"$f":"IF(NOT(ISBLANK('Pricing CoverSheet'!$C$8)),'Pricing CoverSheet'!$C$8,\"\")","v":"Airport Company"}]
[null,null,null,null,null,null,null,null,null,null,null,null,null,null,null,null,"Pricing Period Starting Year Ended",{"$f":"IF(ISNUMBER('Pricing CoverSheet'!$C$12),'Pricing CoverSheet'!$C$12,\"\")","v":"2018-06-30"}]
["SCHEDULE 20: REPORT ON DEMAND FORECASTS"]
["ref","Version 4.0 [DRAFT]"]
[{"$f":"ROW()","v":6},"20a: Passenger terminal demand"]
[{"$f":"ROW()","v":7},null,null,"(000)",null,"Pricing Period Starting Year",null,"Pricing Period Starting Year + 1",null,"Pricing Period Starting Year + 2",null,"Pricing Period Starting Year + 3",null,"Pricing Period Starting Year + 4",null,"Pricing Period Starting Year + 5",null,"Pricing Period Starting Year + 6",null,"Pricing Period Starting Year + 7",null,"Pricing Period Starting Year + 8",null,"Pricing Period Starting Year + 9"]
[{"$f":"ROW()","v":8},null,null,null,{"$f":"IF(ISNUMBER('Pricing CoverSheet'!$C$12),\"for year ended\",\"\")","v":"for year ended"},{"$f":"IF(ISNUMBER('Pricing CoverSheet'!$C$12),DATE(YEAR('Pricing CoverSheet'!$C$12),MONTH('Pricing CoverSheet'!$C$12),DAY('Pricing CoverSheet'!$C$12)),\"\")","v":"2018-06-30"},null,{"$f":"IF(ISNUMBER('Pricing CoverSheet'!$C$12),DATE(YEAR('Pricing CoverSheet'!$C$12)+1,MONTH('Pricing CoverSheet'!$C$12),DAY('Pricing CoverSheet'!$C$12)),\"\")","v":"2019-06-30"},null,{"$f":"IF(ISNUMBER('Pricing CoverSheet'!$C$12),DATE(YEAR('Pricing CoverSheet'!$C$12)+2,MONTH('Pricing CoverSheet'!$C$12),DAY('Pricing CoverSheet'!$C$12)),\"\")","v":"2020-06-30"},null,{"$f":"IF(ISNUMBER('Pricing CoverSheet'!$C$12),DATE(YEAR('Pricing CoverSheet'!$C$12)+3,MONTH('Pricing CoverSheet'!$C$12),DAY('Pricing CoverSheet'!$C$12)),\"\")","v":"2021-06-30"},null,{"$f":"IF(ISNUMBER('Pricing CoverSheet'!$C$12),DATE(YEAR('Pricing CoverSheet'!$C$12)+4,MONTH('Pricing CoverSheet'!$C$12),DAY('Pricing CoverSheet'!$C$12)),\"\")","v":"2022-06-30"},null,{"$f":"IF(ISNUMBER('Pricing CoverSheet'!$C$12),DATE(YEAR('Pricing CoverSheet'!$C$12)+5,MONTH('Pricing CoverSheet'!$C$12),DAY('Pricing CoverSheet'!$C$12)),\"\")","v":"2023-06-30"},null,{"$f":"IF(ISNUMBER('Pricing CoverSheet'!$C$12),DATE(YEAR('Pricing CoverSheet'!$C$12)+6,MONTH('Pricing CoverSheet'!$C$12),DAY('Pricing CoverSheet'!$C$12)),\"\")","v":"2024-06-30"},null,{"$f":"IF(ISNUMBER('Pricing CoverSheet'!$C$12),DATE(YEAR('Pricing CoverSheet'!$C$12)+7,MONTH('Pricing CoverSheet'!$C$12),DAY('Pricing CoverSheet'!$C$12)),\"\")","v":"2025-06-30"},null,{"$f":"IF(ISNUMBER('Pricing CoverSheet'!$C$12),DATE(YEAR('Pricing CoverSheet'!$C$12)+8,MONTH('Pricing CoverSheet'!$C$12),DAY('Pricing CoverSheet'!$C$12)),\"\")","v":"2026-06-30"},null,{"$f":"IF(ISNUMBER('Pricing CoverSheet'!$C$12),DATE(YEAR('Pricing CoverSheet'!$C$12)+9,MONTH('Pricing CoverSheet'!$C$12),DAY('Pricing CoverSheet'!$C$12)),\"\")","v":"2027-06-30"}]
["amended",null,"Busy hour passenger numbers","Inbound passengers","Domestic"]
["amended",null,null,null,"International"]
["amended",null,null,null,"Combined *"]
[{"$f":"ROW()","v":12}]
["amended",null,null,"Outbound passengers","Domestic"]
["amended",null,null,null,"International"]
["amended",null,null,null,"Combined *"]
[{"$f":"ROW()","v":16},null,null,null,null,"* No disclosure of combined terminal forecasts is required for airports with no shared passenger terminal functional components."]
["amended",null,"Number of passengers during year","Inbound passengers","Domestic"]
["amended",null,null,null,"International"]
[{"$f":"ROW()","v":19},null,null,null,"Total",{"$f":"SUM(F17:F18)","v":0},null,{"$f":"SUM(H17:H18)","v":0},null,{"$f":"SUM(J17:J18)","v":0},null,{"$f":"SUM(L17:L18)","v":0},null,{"$f":"SUM(N17:N18)","v":0},null,{"$f":"SUM(P17:P18)","v":0},null,{"$f":"SUM(R17:R18)","v":0},null,{"$f":"SUM(T17:T18)","v":0},null,{"$f":"SUM(V17:V18)","v":0},null,{"$f":"SUM(X17:X18)","v":0}]
[{"$f":"ROW()","v":20}]
["amended",null,null,"Outbound passengers","Domestic"]
["amended",null,null,null,"International"]
[{"$f":"ROW()","v":23},null,null,null,"Total",{"$f":"SUM(F21:F22)","v":0},null,{"$f":"SUM(H21:H22)","v":0},null,{"$f":"SUM(J21:J22)","v":0},null,{"$f":"SUM(L21:L22)","v":0},null,{"$f":"SUM(N21:N22)","v":0},null,{"$f":"SUM(P21:P22)","v":0},null,{"$f":"SUM(R21:R22)","v":0},null,{"$f":"SUM(T21:T22)","v":0},null,{"$f":"SUM(V21:V22)","v":0},null,{"$f":"SUM(X21:X22)","v":0}]
[{"$f":"ROW()","v":24}]
[{"$f":"ROW()","v":25},null,null,"International transit and transfer passengers†"]
[{"$f":"ROW()","v":26},null,null,null,null,"† NB. Forecasts of international transit and transfer passenger numbers relate only to airports with extant or planned international transit and transfer facilities"]
[{"$f":"ROW()","v":27},null,null,null,null,null,null,null,null,null,null,null,null,null,null,null,null,null,null,null,null,null,null,null,"Page 10"]
[]
[]
[null,null,null,null,null,null,null,null,null,null,null,null,null,null,null,null,"Regulated Airport",{"$f":"IF(NOT(ISBLANK('Pricing CoverSheet'!$C$8)),'Pricing CoverSheet'!$C$8,\"\")","v":"Airport Company"}]
{"$rows_left_out":42}