{"text_format":"1","workbook":"xlsx","n_sheets":15,"sheets":["CoverSheet","Description","Table of Contents","Inputs","GPB data","Timing","Diag","RAB","Tax","BBAR","Rev","MAR","Outputs","Outputs to Chartbook","Notes"],"not_rendered":{"charts":0,"images":2,"macros":1,"external_links":5,"defined_names":36,"comments":2,"pivot_tables":0},"unopened":[],"bounds":{"document_bytes":16777216,"sheet_cells":100000,"rows_first":2000,"rows_last":500,"rows_between":2000,"halvings":0,"cell_chars":16384,"cell_head_chars":4096},"cells_cut":0,"cells_raw":0,"read":"whole","date_system":"1900"}

{"sheet":"CoverSheet","index":0,"n_rows":17,"n_cols":1,"rows_kept":17,"cut":false,"hidden":false,"merged":[]}
[]
[]
["Gas Pipeline Businesses"]
["Price-Quality Regulation 1 October 2022 Reset"]
["Default Price Path Draft Financial Model"]
[]
[]
[]
[]
[]
{"$rows_left_out":8}
{"sheet":"Description","index":1,"n_rows":22,"n_cols":3,"rows_kept":22,"cut":false,"hidden":false,"merged":[[10,2,10,5],[11,2,11,5],[12,2,12,5],[3,1,3,5],[5,1,5,5],[7,2,7,5],[8,2,8,5],[9,2,9,5],[18,2,18,5],[19,2,19,5],[21,2,21,5],[14,2,14,5],[13,2,13,5]]}
["Description"]
[]
["General Description"]
[null,"This is the financial model prepared by the Commission to calculate starting prices for those GPBs (suppliers) that are subject to default price quality regulation as from 1 October 2022."]
[null,"Data"]
[null,"Data inputs do not currently reflect expected values for the 2022 reset. They are mostly our best data  inputs, and will be updated as the final decision approaches."]
[null,"Notes:"]
[null,1,"Financial quantities in this model are expressed in NZD'000. All values are nominal, except for present values which are defined where they are used."]
[null,2,"All data used by the model are entered in the 'Input' worksheet. "]
[null,3,"The 'Output' worksheet uses Excel's data table facility to display the calculated results for all suppliers."]
{"$rows_left_out":13}
{"sheet":"Table of Contents","index":2,"n_rows":38,"n_cols":3,"rows_kept":38,"cut":false,"hidden":false,"merged":[]}
["Table of Contents"]
[]
[]
[null,"Sheet Name","Link"]
[null,"Inputs","Inputs"]
[null,"GPB data","Inputs for the selected supplier"]
[null,"Timing","Timing"]
[null,null,"Inputs"]
[null,null,"Calculations"]
[null,null,"Outputs"]
{"$rows_left_out":29}
{"sheet":"Inputs","index":3,"n_rows":90,"n_cols":11,"rows_kept":90,"cut":false,"hidden":false,"merged":[]}
["Inputs","Values, not time series","Early base year","Standard base year","Gap year","1st BBAR year","2nd BBAR year","3rd BBAR year","4th BBAR year","5th BBAR year"]
["All input data is entered into this worksheet.","Exceptions to the principle that an inputs sheet should not include anything other than inputs have this grey background."]
["Name of supplier currently chosen as the focus of this workbook",null,"Powerco"]
["Supplier number (inferred from chosen name above)",null,{"$f":"HLOOKUP(GPB_name,Inputs!$B$22:$G$23,2,FALSE)","v":2}]
["Supplier number (from Output sheet)",null,{"$f":"Outputs!B4","v":2}]
["Inputs that are the same for all suppliers"]
["BBAR year ending in calendar year:",null,{"$f":"D7-1","v":2020},{"$f":"E7-1","v":2021},{"$f":"F7-1","v":2022},2023,{"$f":"F7+1","v":2024},{"$f":"G7+1","v":2025},{"$f":"H7+1","v":2026},{"$f":"I7+1","v":2027}]
["Forecast changes in CPI used for revaluations, June year-ends",null,null,{"$f":"[1]Output!G8","v":3.3428844317096473E-2},{"$f":"[1]Output!H8","v":5.2000000000000046E-2},{"$f":"[1]Output!I8","v":2.4999999999999911E-2},{"$f":"[1]Output!J8","v":2.0999999999999908E-2},{"$f":"[1]Output!K8","v":2.0000000000000018E-2},{"$f":"[1]Output!L8","v":2.0000000000000018E-2},{"$f":"[1]Output!M8","v":2.0000000000000018E-2}]
["Forecast changes in CPI used for revaluations, September year-ends",null,null,{"$f":"[1]Output!G9","v":4.933586337760909E-2},{"$f":"[1]Output!H9","v":4.0000000000000036E-2},{"$f":"[1]Output!I9","v":2.2999999999999909E-2},{"$f":"[1]Output!J9","v":2.0000000000000018E-2},{"$f":"[1]Output!K9","v":2.0000000000000018E-2},{"$f":"[1]Output!L9","v":2.0000000000000018E-2},{"$f":"[1]Output!M9","v":2.0000000000000018E-2}]
["Forecast changes in the CPI element of the price path for GDB",null,null,{"$f":"[1]Output!G10","v":1.8826405867970575E-2},{"$f":"[1]Output!H10","v":1.4638828893688505E-2},{"$f":"[1]Output!I10","v":4.9252365184484281E-2},{"$f":"[1]Output!J10","v":3.8361409969120297E-2},{"$f":"[1]Output!K10","v":2.2487822846806393E-2},{"$f":"[1]Output!L10","v":2.0247710973710253E-2},{"$f":"[1]Output!M10","v":2.0000000000000018E-2}]
{"$rows_left_out":81}
{"sheet":"GPB data","index":4,"n_rows":97,"n_cols":10,"rows_kept":97,"cut":false,"hidden":false,"merged":[]}
["Inputs for the selected supplier","Values, not time series","Early base year","Standard base year","Gap year","1st BBAR or Pricing year","2nd BBAR or Pricing year","3rd BBAR or Pricing year","4th BBAR or Pricing year","5th BBAR or Pricing year"]
["Data from the Inputs sheet that relates to the selected supplier. The supplier's name is user-selected in cell C3 on the Inputs sheet.",null,{"$f":" TEXT(EOMONTH($B$17+1,-25)+1,\"dd.mm.yy\")  & \" to \" & TEXT(EOMONTH($B$17,-12),\"dd.mm.yy\")","v":"01.10.19 to 30.09.20"},{"$f":" TEXT(EOMONTH($B$17+1,-13)+1,\"dd.mm.yy\")  & \" to \" & TEXT(EOMONTH($B$17,0),\"dd.mm.yy\")","v":"01.10.20 to 30.09.21"},{"$f":" TEXT(EOMONTH($B$17+1,-1)+1,\"dd.mm.yy\")  & \" to \" & TEXT(EOMONTH($B$17,12),\"dd.mm.yy\")","v":"01.10.21 to 30.09.22"},{"$f":" TEXT(EOMONTH($B$17+1,11)+1,\"dd.mm.yy\")  & \" to \" & TEXT(EOMONTH($B$17,24),\"dd.mm.yy\")","v":"01.10.22 to 30.09.23"},{"$f":" TEXT(EOMONTH($B$17+1,23)+1,\"dd.mm.yy\")  & \" to \" & TEXT(EOMONTH($B$17,36),\"dd.mm.yy\")","v":"01.10.23 to 30.09.24"},{"$f":" TEXT(EOMONTH($B$17+1,35)+1,\"dd.mm.yy\")  & \" to \" & TEXT(EOMONTH($B$17,48),\"dd.mm.yy\")","v":"01.10.24 to 30.09.25"},{"$f":" TEXT(EOMONTH($B$17+1,47)+1,\"dd.mm.yy\")  & \" to \" & TEXT(EOMONTH($B$17,60),\"dd.mm.yy\")","v":"01.10.25 to 30.09.26"},{"$f":" TEXT(EOMONTH($B$17+1,59)+1,\"dd.mm.yy\")  & \" to \" & TEXT(EOMONTH($B$17,72),\"dd.mm.yy\")","v":"01.10.26 to 30.09.27"}]
["Supplier",null,null,null,null,null,null,null,null,{"$f":"GPB_name","v":"Powerco"}]
["Supplier number",null,{"$f":"Inputs!C5","v":2}]
["General data"]
["Non business-specific single inputs"]
[{"$f":"Inputs!A16","v":"Vanilla WACC (67th percentile)"},{"$f":"Inputs!B16","v":6.0699999999999997E-2}]
[{"$f":"Inputs!A17","v":"Cost of debt"},{"$f":"Inputs!B17","v":4.0099999999999997E-2}]
[{"$f":"Inputs!A18","v":"Leverage"},{"$f":"Inputs!B18","v":0.42}]
[{"$f":"Inputs!A19","v":"Remaining asset life for additional assets before adjustment"},{"$f":"Inputs!B19","v":45},"years"]
{"$rows_left_out":88}
{"sheet":"Timing","index":5,"n_rows":32,"n_cols":10,"rows_kept":32,"cut":false,"hidden":false,"merged":[]}
["Timing",null,null,null,null,"1st BBAR year","2nd BBAR year","3rd BBAR year","4th BBAR year","5th BBAR year"]
["Calculations related to timing"]
["Inputs"]
["Days from mid-year to year-end",null,{"$f":"'GPB data'!B12","v":182}]
["Days from revenue date to year-end",null,{"$f":"'GPB data'!B13","v":148}]
["Vanilla WACC (67th percentile)",null,{"$f":"WACC","v":6.0699999999999997E-2}]
[{"$f":"'GPB data'!A17","v":"Last day in the standard base year"},null,{"$f":"'GPB data'!B17","v":"2021-09-30"}]
[{"$f":"'GPB data'!A14","v":"Day prior to start of the regulatory period"},null,{"$f":"'GPB data'!B14","v":"2022-09-30"}]
["Calculations"]
["Year-end of 1st BBAR year",null,{"$f":"EOMONTH(C7,24)","v":"2023-09-30"}]
{"$rows_left_out":23}
{"sheet":"Diag","index":6,"n_rows":34,"n_cols":37,"rows_kept":34,"cut":false,"hidden":false,"merged":[[22,26,22,29],[20,26,20,29],[13,29,13,32]]}
[]
["Gas Pipeline Businesses - DPP reset - Years in the next regulatory period"]
[]
[null,"first day in quarter",{"$f":"EOMONTH(C5,-3)+1","v":"2019-10-01"},"2020-01-01","2020-04-01","2020-07-01","2020-10-01","2021-01-01","2021-04-01","2021-07-01","2021-10-01",{"$f":"EOMONTH(L5,-3)+1","v":"2022-01-01"},{"$f":"EOMONTH(M5,-3)+1","v":"2022-04-01"},{"$f":"EOMONTH(N5,-3)+1","v":"2022-07-01"},"2022-10-01","2023-01-01","2023-04-01","2023-07-01","2023-10-01","2024-01-01","2024-04-01","2024-07-01","2024-10-01","2025-01-01","2025-04-01","2025-07-01","2025-10-01","2026-01-01","2026-04-01","2026-07-01","2026-10-01","2027-01-01","2027-04-01","2027-07-01","2027-10-01","2028-01-01","2028-04-01"]
[null,"last day in quarter","2019-12-31",{"$f":"EOMONTH(C5,3)","v":"2020-03-31"},{"$f":"EOMONTH(D5,3)","v":"2020-06-30"},"2020-09-30","2020-12-31","2021-03-31","2021-06-30","2021-09-30","2021-12-31","2022-03-31","2022-06-30","2022-09-30","2022-12-31","2023-03-31","2023-06-30","2023-09-30","2023-12-31","2024-03-31","2024-06-30","2024-09-30","2024-12-31","2025-03-31","2025-06-30","2025-09-30","2025-12-31","2026-03-31","2026-06-30","2026-09-30","2026-12-31","2027-03-31","2027-06-30","2027-09-30","2027-12-31","2028-03-31","2028-06-30"]
["Columns in the RAB, Tax & BBAR sheets"]
[]
[null,null,"C",null,null,null,"D",null,null,null,"E",null,null,null,"F",null,null,null,"G",null,null,null,"H",null,null,null,"I",null,null,null,"J"]
[]
[null,"Last month in the quarter",{"$f":"C5","v":"2019-12-31"},{"$f":"D5","v":"2020-03-31"},"2020-06-30","2020-09-30","2020-12-31","2021-03-31","2021-06-30","2021-09-30","2021-12-31","2022-03-31","2022-06-30","2022-09-30","2022-12-31","2023-03-31","2023-06-30","2023-09-30","2023-12-31","2024-03-31","2024-06-30","2024-09-30","2024-12-31","2025-03-31","2025-06-30","2025-09-30","2025-12-31","2026-03-31","2026-06-30","2026-09-30","2026-12-31","2027-03-31","2027-06-30"]
{"$rows_left_out":25}
{"sheet":"RAB","index":7,"n_rows":102,"n_cols":14,"rows_kept":102,"cut":false,"hidden":false,"merged":[]}
["Regulatory asset base","Values, not time series","Early base year","Standard base year","Gap year","1st BBAR year","2nd BBAR year","3rd BBAR year","4th BBAR year","5th BBAR year",null,"Spec ref","GTB IM reference","GDB IM reference"]
["Calculations relating to RAB values for full years"]
["Inputs",null,null,null,null,null,null,null,null,{"$f":"GPB_name","v":"Powerco"}]
["BBAR year ending in calendar year:",null,{"$f":"'GPB data'!C18","v":2020},{"$f":"'GPB data'!D18","v":2021},{"$f":"'GPB data'!E18","v":2022},{"$f":"'GPB data'!F18","v":2023},{"$f":"'GPB data'!G18","v":2024},{"$f":"'GPB data'!H18","v":2025},{"$f":"'GPB data'!I18","v":2026},{"$f":"'GPB data'!J18","v":2027}]
["Opening RAB",null,{"$f":"'GPB data'!C34","v":383406.53975222597},{"$f":"'GPB data'!D34","v":"~"}]
["Total depreciation",null,{"$f":"'GPB data'!C35","v":18774.392543323182},{"$f":"'GPB data'!D35","v":"~"}]
["Closing RAB",null,{"$f":"'GPB data'!C36","v":387505.49067092908},{"$f":"'GPB data'!D36","v":"~"}]
["Value of disposed assets",null,null,{"$f":"'GPB data'!D89","v":394.29968347494963},{"$f":"'GPB data'!E89","v":410.07167081394755},{"$f":"'GPB data'!F89","v":419.50331924266834},{"$f":"'GPB data'!G89","v":427.89338562752175},{"$f":"'GPB data'!H89","v":436.45125334007218},{"$f":"'GPB data'!I89","v":445.18027840687364},{"$f":"'GPB data'!J89","v":454.08388397501113}]
["Value of commissioned assets",null,null,{"$f":"'GPB data'!D78","v":18279.357081665923},{"$f":"'GPB data'!E78","v":18254.944307387064},{"$f":"'GPB data'!F78","v":18972.860604440149},{"$f":"'GPB data'!G78","v":19067.583203541584},{"$f":"'GPB data'!H78","v":20001.435638270308},{"$f":"'GPB data'!I78","v":21763.789530019396},{"$f":"'GPB data'!J78","v":21883.414211661617}]
["Remaining life for additional assets before adjustment factor",{"$f":"'GPB data'!B10","v":45}]
{"$rows_left_out":93}
{"sheet":"Tax","index":8,"n_rows":105,"n_cols":13,"rows_kept":105,"cut":false,"hidden":false,"merged":[]}
["Tax calculations","Values, not time series","Early base year","Standard base year","Gap year","1st BBAR year","2nd BBAR year","3rd BBAR year","4th BBAR year","5th BBAR year","Spec ref","GTB IM reference","GDB IM reference"]
["Calculation of adjusted depreciation, tax depreciation, deferred tax, notional deductible interest and regulatory tax adjustments."]
["Inputs",null,null,null,null,null,null,null,null,{"$f":"GPB_name","v":"Powerco"}]
["BBAR year ending in calendar year:",null,{"$f":"'GPB data'!C18","v":2020},{"$f":"'GPB data'!D18","v":2021},{"$f":"'GPB data'!E18","v":2022},{"$f":"'GPB data'!F18","v":2023},{"$f":"'GPB data'!G18","v":2024},{"$f":"'GPB data'!H18","v":2025},{"$f":"'GPB data'!I18","v":2026},{"$f":"'GPB data'!J18","v":2027},"GPB data"]
["Corporate tax rate",null,{"$f":"'GPB data'!C23","v":0.28000000000000003},{"$f":"'GPB data'!D23","v":0.28000000000000003},{"$f":"'GPB data'!E23","v":0.28000000000000003},{"$f":"'GPB data'!F23","v":0.28000000000000003},{"$f":"'GPB data'!G23","v":0.28000000000000003},{"$f":"'GPB data'!H23","v":0.28000000000000003},{"$f":"'GPB data'!I23","v":0.28000000000000003},{"$f":"'GPB data'!J23","v":0.28000000000000003},"GPB data"]
["Value of commissioned assets",null,{"$f":"'GPB data'!C78","v":15767.357365830479},{"$f":"'GPB data'!D78","v":18279.357081665923},{"$f":"'GPB data'!E78","v":18254.944307387064},{"$f":"'GPB data'!F78","v":18972.860604440149},{"$f":"'GPB data'!G78","v":19067.583203541584},{"$f":"'GPB data'!H78","v":20001.435638270308},{"$f":"'GPB data'!I78","v":21763.789530019396},{"$f":"'GPB data'!J78","v":21883.414211661617},"RAB"]
["Remaining life for additional assets",null,null,{"$f":"'GPB data'!B10","v":45},null,null,null,null,null,null,"GPB data"]
["Amortisation of initial differences in asset values",{"$f":"'GPB data'!B43","v":2292.4988392105784},null,null,null,null,null,null,null,null,"GPB data"]
["Value of disposed assets",null,null,{"$f":"'GPB data'!D89","v":394.29968347494963},{"$f":"'GPB data'!E89","v":410.07167081394755},{"$f":"'GPB data'!F89","v":419.50331924266834},{"$f":"'GPB data'!G89","v":427.89338562752175},{"$f":"'GPB data'!H89","v":436.45125334007218},{"$f":"'GPB data'!I89","v":445.18027840687364},{"$f":"'GPB data'!J89","v":454.08388397501113},"RAB"]
["Opening RAB excluding revaluations",null,{"$f":"'GPB data'!C37","v":345486.45933587506},{"$f":"'GPB data'!D37","v":"~"},null,null,null,null,null,null,"GPB data"]
{"$rows_left_out":96}
{"sheet":"BBAR","index":9,"n_rows":95,"n_cols":13,"rows_kept":95,"cut":false,"hidden":false,"merged":[]}
["Building blocks allowable revenue","Values, not time series","Early base year","Std base year","Gap year","1st BBAR year","2nd BBAR year","3rd BBAR year","4th BBAR year","5th BBAR year"," ","Spec ref","IM ref"]
["Calculation of BBAR present value, opening investment value, and TCSD allowance."]
["Inputs",null,null,null,null,null,null,null,null,{"$f":"GPB_name","v":"Powerco"}]
["Tax payable (payable) or deferred tax (deferred)",{"$f":"'GPB data'!B29","v":"deferred"}]
["Vanilla WACC (67th percentile)",{"$f":"WACC","v":6.0699999999999997E-2}]
["Term credit spread differential allowance",null,{"$f":"'GPB data'!C41","v":396.24630036237602},{"$f":"'GPB data'!D41","v":"~"},null,null,null,null,null,null,null,"GPB data"]
["BBAR year ending in calendar year:",null,null,{"$f":"'GPB data'!D18","v":2021},{"$f":"'GPB data'!E18","v":2022},{"$f":"'GPB data'!F18","v":2023},{"$f":"'GPB data'!G18","v":2024},{"$f":"'GPB data'!H18","v":2025},{"$f":"'GPB data'!I18","v":2026},{"$f":"'GPB data'!J18","v":2027},null,"GPB data"]
["Corporate tax rate",null,null,null,null,{"$f":"'GPB data'!F23","v":0.28000000000000003},{"$f":"'GPB data'!G23","v":0.28000000000000003},{"$f":"'GPB data'!H23","v":0.28000000000000003},{"$f":"'GPB data'!I23","v":0.28000000000000003},{"$f":"'GPB data'!J23","v":0.28000000000000003},null,"GPB data"]
["Other regulated income",null,null,null,null,{"$f":"'GPB data'!F97","v":333.19467892487523},{"$f":"'GPB data'!G97","v":339.85857250337267},{"$f":"'GPB data'!H97","v":346.65574395344026},{"$f":"'GPB data'!I97","v":353.58885883250906},{"$f":"'GPB data'!J97","v":360.66063600915913},null,"GPB data"]
[]
{"$rows_left_out":86}
{"sheet":"Rev","index":10,"n_rows":28,"n_cols":12,"rows_kept":28,"cut":false,"hidden":false,"merged":[]}
["Revenue growth index",null,null,"Values, not time series",null,"1st revenue year","2nd revenue year","3rd revenue year","4th revenue year",null,null,"Spec ref"]
["Calculation of the normalised profile of the maximum allowable revenue before tax values."]
["Inputs",null,null,null,null,null,null,null,{"$f":"GPB_name","v":"Powerco"}]
["Pricing year ending in calendar year:",null,null,null,{"$f":"'GPB data'!E18","v":2022},{"$f":"'GPB data'!F18","v":2023},{"$f":"'GPB data'!G18","v":2024},{"$f":"'GPB data'!H18","v":2025},{"$f":"'GPB data'!I18","v":2026},null,null,"GPB data"]
["Constant price revenue growth",null,null,null,null,null,{"$f":"'GPB data'!G66","v":1.4273190553534185E-2},{"$f":"'GPB data'!H66","v":1.3617866651395364E-2},{"$f":"'GPB data'!I66","v":1.2969710871687067E-2},null,null,"GPB data"]
["Industry-wide X factor",null,null,{"$f":"'GPB data'!B11","v":0},null,null,null,null,null,null,null,"GPB data"]
["Alternative X factor",null,null,{"$f":"'GPB data'!B44","v":-7.4856321772311094E-2},null,null,null,null,null,null,null,"GPB data"]
[]
["Forecast changes in the CPI element of the price path, no lag",null,null,null,null,null,{"$f":"'GPB data'!G27","v":3.8361409969120297E-2},{"$f":"'GPB data'!H27","v":2.2487822846806393E-2},{"$f":"'GPB data'!I27","v":2.0247710973710253E-2}]
["Total revenue cap (TRC) or weighted average price cap (WAPC)",null,null,{"$f":"'GPB data'!B30","v":"WAPC"},null,null,null,null,null,null,null,"GPB data"]
{"$rows_left_out":19}
{"sheet":"MAR","index":11,"n_rows":75,"n_cols":11,"rows_kept":75,"cut":false,"hidden":false,"merged":[]}
["Maximum allowable revenue",null,"Values, not time series",null,null,"1st Revenue year","2nd Revenue year","3rd Revenue year","4th Revenue year",null,"Spec ref"]
["Calculation of starting prices."]
["Inputs",null,null,null,null,null,null,null,{"$f":"GPB_name","v":"Powerco"},null,"Simple ref"]
["Pricing year ending in calendar year:",null,null,null,null,{"$f":"'GPB data'!F18","v":2023},{"$f":"'GPB data'!G18","v":2024},{"$f":"'GPB data'!H18","v":2025},{"$f":"'GPB data'!I18","v":2026},null,"GPB data"]
["Year in regulatory period",null,null,null,null,1,{"$f":"F5+1","v":2},{"$f":"G5+1","v":3},{"$f":"H5+1","v":4},null,"GPB data"]
["Industry-wide X factor",null,{"$f":"'GPB data'!B11","v":0},null,null,null,null,null,null,null,"GPB data"]
["Alternative X factor",null,{"$f":"'GPB data'!B44","v":-7.4856321772311094E-2},null,null,null,null,null,null,null,"GPB data"]
["Vanilla WACC (67th percentile)",null,{"$f":"WACC","v":6.0699999999999997E-2},null,null,null,null,null,null,null,"GPB data"]
["TFrev",null,{"$f":"Timing!C27","v":1.024182287603089},null,null,null,null,null,null,null,"TIMING"]
["Constant price revenue growth in year ending 2022",null,{"$f":"'GPB data'!E66","v":1.5341429928627356E-2},null,null,null,null,null,null,null,"GPB data"]
{"$rows_left_out":66}
{"sheet":"Outputs","index":12,"n_rows":45,"n_cols":7,"rows_kept":45,"cut":false,"hidden":false,"merged":[]}
["DPP reset output table"]
["This worksheet uses Excel's data table facility to display the calculated results for all suppliers."]
["Chosen supplier",{"$f":"GPB_name","v":"Powerco"}]
["Supplier number",{"$f":"Inputs!C4","v":2}]
["tax timing","tax date mid-period"]
[null,"Active GDB outputs",{"$f":"Inputs!B22","v":"GasNet"},{"$f":"Inputs!C22","v":"Powerco"},{"$f":"Inputs!D22","v":"Vector"},{"$f":"Inputs!E22","v":"First Gas distribution"},{"$f":"Inputs!F22","v":"First Gas transmission"}]
["Supplier number",{"$f":"B4","v":2},{"$f":"Inputs!B23","v":1},{"$f":"Inputs!C23","v":2},{"$f":"Inputs!D23","v":3},{"$f":"Inputs!E23","v":4},{"$f":"Inputs!F23","v":5}]
["Outputs",null,0,0,0,0,0]
["PV of BBAR at 30 September 2022",{"$f":"BBAR!B89","v":247968.44579602161},19288.022512010655,247968.44579602161,230462.78073921002,119361.95681755489,626669.19578076468]
["Starting price for industry-wide X factor",{"$f":"MAR!F71","v":65707.694950966543},5212.2961959966597,65707.694950966543,61377.285044251381,32620.65292521644,171803.8481991349]
{"$rows_left_out":36}
{"sheet":"Outputs to Chartbook","index":13,"n_rows":99,"n_cols":8,"rows_kept":99,"cut":false,"hidden":false,"merged":[]}
["Outputs to chartbook"]
[]
[]
["Reasons Paper Charts"]
["Chapter 4 tables"]
[null,"Table 4.1 Proposed MAR in each year of the regulatory period ($m, nominal)"]
[null,"Year","2021/2022 forecast MAR","2022/2023","2023/2024","2024/2025","2025/2026"]
[null,"GasNet",{"$f":"(Outputs!C28)/1000","v":4.3839982678933236},{"$f":"(Outputs!$C$17)/1000","v":4.8387890143305832},{"$f":"(Outputs!$C$18)/1000","v":5.2841277471938444},{"$f":"(Outputs!$C$19)/1000","v":5.6810290577007203},{"$f":"(Outputs!$C$20)/1000","v":6.093140701897255}]
[null,"Powerco",{"$f":"(Outputs!D28)/1000","v":51.435568618416461},{"$f":"(Outputs!$D$17)/1000","v":58.875074667292026},{"$f":"(Outputs!$D$18)/1000","v":66.647731492930163},{"$f":"(Outputs!$D$19)/1000","v":74.245167016280959},{"$f":"(Outputs!$D$20)/1000","v":82.474690088078376}]
[null,"Vector",{"$f":"(Outputs!E28)/1000","v":50.702277198411046},{"$f":"(Outputs!$E$17)/1000","v":56.85601745141377},{"$f":"(Outputs!$E$18)/1000","v":62.771439747555824},{"$f":"(Outputs!$E$19)/1000","v":68.230698461355786},{"$f":"(Outputs!$E$20)/1000","v":73.989155492156982}]
{"$rows_left_out":90}
{"sheet":"Notes","index":14,"n_rows":58,"n_cols":4,"rows_kept":58,"cut":false,"hidden":false,"merged":[]}
["Model notes"]
[]
["Ref #","Description","Calculation method","Input methodology reference, rationale, reference or other justification for the calculation method"]
[]
["BBAR sheet"]
[1,"Proportion of BBAR year in the regulatory period","Number of BBAR months in the regulatory period / 12","Standard calculation for a proportion."]
[{"$f":"A6+1","v":2},"Cumulative number of days from start of regulatory period to end of BBAR period","Zero in the gap year, otherwise equals the previous year's value + Number of BBAR days in the BBAR period","Standard calculation for a cumulative value"]
[{"$f":"A7+1","v":3},"PV factor from end of each BBAR period","(1+WACC)^(-1*Cumulative number of days from start of regulatory period to end of BBAR period/365)","Standard present value formula for the present value factor for a period of \"n\" years."]
[4,"Asset base scaling factor","Aggregate opening RAB value in each BBAR period / Aggregate opening RAB value in the base year","IM paragraph 4.4.9(2) sets the TCSD allowance at a × b ÷ c. The asset base scaling factor is the b ÷ c in this formula."]
[5,"Term credit spread differential allowance","Term credit spread differential allowance * Asset base scaling factor","TCSD allowance is calculated according to IM 4.4.9(2) by this formula. See definition of the asset base scaling factor above."]
{"$rows_left_out":48}