{"text_format":"1","workbook":"xlsx","n_sheets":10,"sheets":["Coversheet","Description","Table of Contents","Inputs","RABx","TAXx","DTAXx","BBARx","MARx","Output"],"not_rendered":{"charts":0,"images":2,"macros":1,"external_links":0,"defined_names":21,"comments":0,"pivot_tables":0},"unopened":[],"bounds":{"document_bytes":16777216,"sheet_cells":100000,"rows_first":2000,"rows_last":500,"rows_between":2000,"halvings":0,"cell_chars":16384,"cell_head_chars":4096},"cells_cut":0,"cells_raw":0,"read":"whole","date_system":"1900"}

{"sheet":"Coversheet","index":0,"n_rows":17,"n_cols":1,"rows_kept":17,"cut":false,"hidden":false,"merged":[]}
[]
[]
["Financial Model"]
["Powerco Customised Price-Quality Path Proposal"]
["Draft Determination 16 November 2017"]
[]
[]
[]
[]
[]
[]
[]
[]
[]
[]
{"$rows_left_out":3}
{"sheet":"Description","index":1,"n_rows":7,"n_cols":2,"rows_kept":7,"cut":false,"hidden":false,"merged":[]}
["Description"]
[]
[null,"This model is published alongside the Commerce Commission's draft determination \"[DRAFT] Powerco Limited Electricity Distribution Customised Price-Quality Path Determination 2018\", and calculates the draft starting price of $278,559,000 that is set out in Schedule 1.1 of the draft determination."]
[]
[null,"The model applies the price path methodologies set out in the Electricity Distributionj Input Methodologies (EDB IMs). It is derived from the model used in 2013 to calculate the CPP for Orion New Zealand Ltd, adjusted to include the applicable methodologies in subsequent EDB IM amendment determinations. The model calculates the starting price, and estimates the prices in each subsequent year of the regulatory period."]
[]
[null,"Entry cell C2 of the Inputs worksheet is used to switch the model between one of two scenarios.\n●  Scenario 1 reproduces Powerco's calculations of its proposed price path with the alternative WACC described in section 18.3.7 of \"Customised price-quality path (CPP) Main Proposal\", Powerco, 12 May 2017.\n●  Scenario 2 is the draft price path determined by the Commission."]

{"sheet":"Table of Contents","index":2,"n_rows":28,"n_cols":3,"rows_kept":28,"cut":false,"hidden":false,"merged":[]}
["Table of Contents"]
[]
[]
[null,"Sheet Name","Link"]
[null,"Inputs","CPP Inputs Module"]
[null,"RABx","Regulatory Asset Base (RAB) Module"]
[null,null,"Total Opening RAB value"]
[null,null,"RAB roll-forward without revaluations"]
[null,null,"TFVCA"]
[null,null,"RAB proportionate investment"]
[null,null,"Total revaluation "]
[null,null,"Total depreciation"]
[null,null,"Total opening RAB value without revaluations"]
[null,null,"Total adjusted depreciation"]
[null,"TAXx","Regulatory Tax Module"]
{"$rows_left_out":14}
{"sheet":"Inputs","index":3,"n_rows":65,"n_cols":12,"rows_kept":65,"cut":false,"hidden":false,"merged":[]}
["CPP Inputs Module"]
["Scenario (enter 1 or 2)",null,"Draft determination",{"$f":"IF(C2=\"Proposed\",1,IF(C2=\"Draft determination\",2,NA()))","v":2},"Note: To recalculate, click the 'MAR Goal Seek' macro button located on the MAR worksheet"]
[]
[null,null,null,"Assessment Period",null,"CPP Regulatory Period"]
["Ref.","Input Name","Discrete Input",{"$f":"E5-1","v":2017},{"$f":"$F$6-1","v":2018},{"$f":"$F$6","v":2019},{"$f":"F5+1","v":2020},{"$f":"G5+1","v":2021},{"$f":"IF($C$6>3,H5+1,\"\")","v":2022},{"$f":"IF($C$6>4,I5+1,\"\")","v":2023},"Description","Input source"]
["Input1","CPP regulatory period",5,null,null,2019,null,null,null,null,"The period of continuous disclosure years in respect of which the customised price-quality path applies, and which follows the assessment period. Input the number of years in the regulatory period and the first year in the regulatory period.","Commerce Commission decision."]
["Input2","Allowed controllable opex",null,null,null,null,null,null,null,null,"A series of values ($000) for the CPP regulatory period where a single value for a disclosure year represents the allowance for operating expenditure for that year in categories specified by the Commission as controllable by the supplier.","Not required in this model."]
["Input3","‘X’ factor",0,null,null,null,null,null,null,null,"A single value (percentage 3 d.p.) representing the rate of change allowed for the maximum allowable revenue path where the path is expressed in ‘CPI-X’ terms.","Commerce Commission decision."]
["Input4","Pass-through costs",null,null,null,0,0,0,0,0,"Future uncontrollable costs of the supplier which are to be treated as pass-through costs in each year of the CPP regulatory period in addition to those rates or levies already specified in cl. 3.1.2 of the EDB input methodologies.","Not required in this model."]
["Input5","Recoverable costs",null,null,null,0,0,0,0,0,"A series of values ($000) which are the nominal amounts of verifier fees, auditor’s costs or engineer fees associated with the CPP process that are treated as recoverable costs for each of the disclosure years of the CPP regulatory period.","Not required in this model."]
["Input6","Cost of capital",null,7.1900000000000006E-2,7.1900000000000006E-2,7.1900000000000006E-2,7.1900000000000006E-2,6.7799999999999999E-2,6.7799999999999999E-2,6.7799999999999999E-2,"Discount rate (calculated as the 75th percentile estimate of WACC published most recently by the Commission prior to the submission of the CPP proposal in respect of the CPP regulatory period).","For 2017– 2020: from \"Cost of capital determination for electricity distribution businesses' DPPs\", [2014] NZCC 28, 31 October 2014.  For 2021–2023: CPP applicant proposal."]
["Input7","Inflation rate",null,null,null,2.1069692058346856E-2,2.1528794788826966E-2,2.0972404712461312E-2,2.0276533232868932E-2,2.000000000000024E-2,"Series of values (percentage 3 d.p.) defined in cl. 3.3.1 of the EDB input methodologies.","For 2017– 2020: from EDB DPP reset determination [2014] NZCC33. For 2021–2023: CPP applicant proposal."]
["Input8","ΔQ",null,null,null,0,0,0,0,0,"A series of values (percentage 3 d.p.) for the CPP regulatory period where a single value for a disclosure year represents the forecast weighted average growth in quantities from the preceding disclosure year to the current disclosure year.","Not required in this model."]
["Input9","Claw-back",0,null,null,null,null,null,null,null,"A value ($000) representing the amount of shortfall (negative amount) or over-recovery (positive amount) of revenues relating to prices previously charged by the supplier to be recovered or returned from consumers during the CPP regulatory period. It is expressed in present value terms as at the commencement of the CPP regulatory period.","Not required in this model."]
["Input10","Term Credit Spread Differential Allowance",null,{"$f":"CHOOSE($D$2,D16,D17)","v":1859.6674726388042},1949.4373433176227,2103.1560558259471,2283.154945078717,2432.5036093312824,2604.7329219585413,2798.0306605946275,"A series of values ($000) for the next period where a single value for a disclosure year relates to financing costs from long term debt."]
{"$rows_left_out":51}
{"sheet":"RABx","index":4,"n_rows":66,"n_cols":11,"rows_kept":66,"cut":false,"hidden":false,"merged":[]}
["Regulatory Asset Base (RAB) Module"]
[]
[]
[null,null,null,"Assessment Period",null,"CPP Regulatory Period"]
[null,null,null,{"$f":"Inputs!D5","v":2017},{"$f":"Inputs!E5","v":2018},{"$f":"Inputs!F5","v":2019},{"$f":"Inputs!G5","v":2020},{"$f":"Inputs!H5","v":2021},{"$f":"Inputs!I5","v":2022},{"$f":"Inputs!J5","v":2023},"Input reference"]
[]
["Total Opening RAB value"]
[]
["Opening RAB value",null,null,{"$f":"IF(D$5=Inputs!$D$5,Inputs!D$42,B14)","v":1528013.01067536},{"$f":"IF(E$5=Inputs!$D$5,Inputs!#REF!,D14)","v":1600328.9862576346},{"$f":"IF(F$5=Inputs!$D$5,Inputs!#REF!,E14)","v":1679024.3396552145},{"$f":"IF(G$5=Inputs!$D$5,Inputs!#REF!,F14)","v":1858915.37932494},{"$f":"IF(H$5=Inputs!$D$5,Inputs!#REF!,G14)","v":1981819.3785186475},{"$f":"IF(I$5=Inputs!$D$5,Inputs!#REF!,H14)","v":2110150.4551872853},{"$f":"IF(J$5=Inputs!$D$5,Inputs!#REF!,I14)","v":2271544.3964167293},"Σ(INPUT31) | CALC"]
["less Depreciation",null,null,{"$f":"D52","v":61195.774291130998},62215.540580931047,64499.253294751936,68805.697682358019,73394.734385079209,78135.59792425108,82685.713640126734,"Σ(RAB)"]
["less Disposals",null,null,{"$f":"Inputs!D$43","v":9381.322670455038},{"$f":"Inputs!E$43","v":9476.7861803366341},{"$f":"Inputs!F$43","v":10962.836632004495},{"$f":"Inputs!G$43","v":12853.750141274671},{"$f":"Inputs!H$43","v":13805.949448181686},{"$f":"Inputs!I$43","v":14295.003992473552},{"$f":"Inputs!J$43","v":14566.074836854827},"Σ(INPUT32)"]
["add Revaluation",null,null,{"$f":"D46","v":31967.452413682942},34365.530661231169,35069.180219696471,37709.462264218855,39955.069346831719,42089.564843424319,44759.522436603285,"Σ(RAB)"]
["add Total value of commissioned assets",null,null,{"$f":"Inputs!D$44","v":110925.62013017751},{"$f":"Inputs!E$44","v":116022.14949761658},{"$f":"Inputs!F$44","v":220283.9493767856},{"$f":"Inputs!G$44","v":166853.98475312142},{"$f":"Inputs!H$44","v":175576.69115506724},{"$f":"Inputs!I$44","v":211734.9783027441},{"$f":"Inputs!J$44","v":216264.75514559916},"Σ(INPUT33)"]
["Closing RAB value",null,null,{"$f":"D9-D10-D11+D12+D13","v":1600328.9862576346},{"$f":"E9-E10-E11+E12+E13","v":1679024.3396552145},1858915.37932494,1981819.3785186475,2110150.4551872853,2271544.3964167293,2435316.8855219502,"CALC"]
[]
{"$rows_left_out":52}
{"sheet":"TAXx","index":5,"n_rows":77,"n_cols":11,"rows_kept":77,"cut":false,"hidden":false,"merged":[]}
["Regulatory Tax Module"]
[]
[]
[null,null,null,"Assessment Period",null,"CPP Regulatory Period"]
[null,null,null,{"$f":"Inputs!D5","v":2017},{"$f":"Inputs!E5","v":2018},{"$f":"Inputs!F5","v":2019},{"$f":"Inputs!G5","v":2020},{"$f":"Inputs!H5","v":2021},{"$f":"Inputs!I5","v":2022},{"$f":"Inputs!J5","v":2023},"Input reference"]
[]
["Forecast regulatory tax allowance"]
[]
["Regulatory taxable income",null,null,{"$f":"D20","v":71457.389210229216},{"$f":"E20","v":74268.440179520665},81351.124722041612,89452.087659035315,88497.809721349942,94661.930246193631,100314.0469443457,"TAX"]
["less Utilised tax losses",null,null,{"$f":"D33","v":0},{"$f":"E33","v":0},0,0,0,0,0,"TAX"]
["Adjusted regulatory taxable income (nil if <0)",null,null,{"$f":"MAX(D9-D10,0)","v":71457.389210229216},{"$f":"MAX(E9-E10,0)","v":74268.440179520665},81351.124722041612,89452.087659035315,88497.809721349942,94661.930246193631,100314.0469443457,"CALC"]
["multiply by Corporate tax rate",null,null,{"$f":"D74","v":0.28000000000000003},{"$f":"E74","v":0.28000000000000003},0.28000000000000003,0.28000000000000003,0.28000000000000003,0.28000000000000003,0.28000000000000003,"TAX"]
["Forecast regulatory tax allowance",null,null,{"$f":"D11*D12","v":20008.068978864183},{"$f":"E11*E12","v":20795.163250265789},22778.314922171652,25046.584544529891,24779.386721977986,26505.340468934221,28087.933144416798,"CALC"]
[]
["Regulatory taxable income"]
{"$rows_left_out":63}
{"sheet":"DTAXx","index":6,"n_rows":26,"n_cols":11,"rows_kept":26,"cut":false,"hidden":false,"merged":[]}
["Deferred Tax Module"]
[]
[]
[null,null,null,"Assessment Period",null,"CPP Regulatory Period"]
[null,null,null,{"$f":"Inputs!D5","v":2017},{"$f":"Inputs!E5","v":2018},{"$f":"Inputs!F5","v":2019},{"$f":"Inputs!G5","v":2020},{"$f":"Inputs!H5","v":2021},{"$f":"Inputs!I5","v":2022},{"$f":"Inputs!J5","v":2023},"Input reference"]
[]
["Opening Deferred Tax",null,null,{"$f":"IF(D5=Inputs!$D$5,Inputs!$D$34,B23)","v":-49319.42728444824},{"$f":"IF(E5=Inputs!$D$5,Inputs!$D$34,D23)","v":-59382.266081916074},{"$f":"IF(F5=Inputs!$D$5,Inputs!$D$34,E23)","v":-63695.766451025571},{"$f":"IF(G5=Inputs!$D$5,Inputs!$D$34,F23)","v":-70350.907806228104},{"$f":"IF(H5=Inputs!$D$5,Inputs!$D$34,G23)","v":-81370.646515653731},{"$f":"IF(I5=Inputs!$D$5,Inputs!$D$34,H23)","v":-95080.18450261098},{"$f":"IF(J5=Inputs!$D$5,Inputs!$D$34,I23)","v":-112190.81466581157},"INPUT25 | CALC"]
[]
["Less:"]
["tax effect of amortisation of initial difference in asset values",null,null,{"$f":"TAXx!D68*TAXx!D74","v":2925.0796939840093},{"$f":"TAXx!E68*TAXx!E74","v":2904.6532808998963},{"$f":"TAXx!F68*TAXx!F74","v":2884.3370034757663},{"$f":"TAXx!G68*TAXx!G74","v":2864.1277404902139},{"$f":"TAXx!H68*TAXx!H74","v":2844.0220678545857},{"$f":"TAXx!I68*TAXx!I74","v":2824.0161990624947},{"$f":"TAXx!J68*TAXx!J74","v":2804.1059106631587},"TAX | CALC"]
["Deferred tax balance relating to assets disposed of in the disclosure year in question",null,null,{"$f":"Inputs!D65","v":-699.32930607124217},{"$f":"Inputs!E65","v":-706.44561924645495},{"$f":"Inputs!F65","v":-817.22302960295019},{"$f":"Inputs!G65","v":-958.18089649769172},{"$f":"Inputs!H65","v":-1029.1624525034349},{"$f":"Inputs!I65","v":-1065.6189509210526},{"$f":"Inputs!J65","v":-1085.8258867824916},"INPUT42 ¹"]
["Add:"]
["Tax Effect of Temporary Differences"]
["Adjusted Depreciation",null,null,{"$f":"RABx!D20*TAXx!D74","v":15987.21339707382},{"$f":"RABx!E20*TAXx!E74","v":15906.049188901676},{"$f":"RABx!F20*TAXx!F74","v":16178.699982759123},{"$f":"RABx!G20*TAXx!G74","v":17079.256881695132},{"$f":"RABx!H20*TAXx!H74","v":17987.975049194069},{"$f":"RABx!I20*TAXx!I74","v":18929.152193645055},{"$f":"RABx!J20*TAXx!J74","v":19830.31110775203},"RAB, TAX | CALC"]
["less Tax depreciation",null,null,{"$f":"Inputs!D35*TAXx!D74","v":24112.505995155963},{"$f":"Inputs!E35*TAXx!E74","v":18312.722648026454},{"$f":"Inputs!F35*TAXx!F74","v":21091.489479334505},{"$f":"Inputs!G35*TAXx!G74","v":26560.967192924239},{"$f":"Inputs!H35*TAXx!H74","v":30272.959405579313},{"$f":"Inputs!I35*TAXx!I74","v":34683.983452522632},{"$f":"Inputs!J35*TAXx!J74","v":38594.653255831392},"INPUT26, TAX | CALC"]
{"$rows_left_out":12}
{"sheet":"BBARx","index":7,"n_rows":45,"n_cols":11,"rows_kept":45,"cut":false,"hidden":false,"merged":[]}
["Building Blocks Allowable Revenue (BBAR) Module"]
[]
[]
[null,null,null,"Assessment Period",null,"CPP Regulatory Period"]
[null,null,null,{"$f":"Inputs!D5","v":2017},{"$f":"Inputs!E5","v":2018},{"$f":"Inputs!F5","v":2019},{"$f":"Inputs!G5","v":2020},{"$f":"Inputs!H5","v":2021},{"$f":"Inputs!I5","v":2022},{"$f":"Inputs!J5","v":2023},"Input reference"]
[]
["Building Blocks Allowable Revenue Before Tax (BBAR Before Tax)"]
[]
["Calculation A"]
["Regulatory investment value x Cost of capital",null,null,{"$f":"D45*Inputs!D11","v":106318.06864580656},{"$f":"E45*Inputs!E11","v":110794.06918063416},{"$f":"F45*Inputs!F11","v":116142.12441338119},{"$f":"G45*Inputs!G11","v":128597.78550219539},{"$f":"H45*Inputs!H11","v":128850.42402980298},{"$f":"I45*Inputs!I11","v":136621.76435242093},{"$f":"J45*Inputs!J11","v":146404.17284271223},"BBAR, INPUT6 | CALC"]
["add (Total value of commissioned assets x (TFVCA - 1))",null,null,{"$f":"RABx!D13*(RABx!D31-1)","v":3918.5624061414919},{"$f":"RABx!E13*(RABx!E31-1)","v":4098.6025840336169},{"$f":"RABx!F13*(RABx!F31-1)","v":6064.6677338792069},{"$f":"RABx!G13*(RABx!G31-1)","v":5685.1689665383774},{"$f":"RABx!H13*(RABx!H31-1)","v":5322.9687014699202},{"$f":"RABx!I13*(RABx!I31-1)","v":6160.38090947419},{"$f":"RABx!J13*(RABx!J31-1)","v":5267.3427398616432},"RAB | CALC"]
["add (Term credit spread differential allowance x TF)",null,null,{"$f":"Inputs!D15*Inputs!D18","v":1925.1790329766761},{"$f":"Inputs!E15*Inputs!E18","v":2018.1112777820656},{"$f":"Inputs!F15*Inputs!F18","v":2177.2451265218474},{"$f":"Inputs!G15*Inputs!G18","v":2363.5849386909599},{"$f":"Inputs!H15*Inputs!H18","v":2513.387346508373},{"$f":"Inputs!I15*Inputs!I18","v":2691.3434956358105},{"$f":"Inputs!J15*Inputs!J18","v":2891.0686218526557},"INPUT10, INPUT11 | CALC"]
["less Total revaluation",null,null,{"$f":"RABx!D12","v":31967.452413682942},{"$f":"RABx!E12","v":34365.530661231169},{"$f":"RABx!F12","v":35069.180219696471},{"$f":"RABx!G12","v":37709.462264218855},{"$f":"RABx!H12","v":39955.069346831719},{"$f":"RABx!I12","v":42089.564843424319},{"$f":"RABx!J12","v":44759.522436603285},"RAB"]
[null,null,null,{"$f":"D10+D11+D12-D13","v":80194.357671241785},{"$f":"E10+E11+E12-E13","v":82545.252381218685},89314.857054085762,98937.077143205883,96731.710730949548,103383.92391410661,109803.06176782324,"CALC"]
["divide by TFrev - Corporate tax rate x TF",null,null,{"$f":"Inputs!D19-TAXx!D74*Inputs!D18","v":0.73868990179601857},{"$f":"Inputs!E19-TAXx!E74*Inputs!E18","v":0.73868990179601857},{"$f":"Inputs!F19-TAXx!F74*Inputs!F18","v":0.73868990179601857},{"$f":"Inputs!G19-TAXx!G74*Inputs!G18","v":0.73868990179601857},{"$f":"Inputs!H19-TAXx!H74*Inputs!H18","v":0.73764622101751631},{"$f":"Inputs!I19-TAXx!I74*Inputs!I18","v":0.73764622101751631},{"$f":"Inputs!J19-TAXx!J74*Inputs!J18","v":0.73764622101751631},"INPUT12, TAX, INPUT11 | CALC"]
{"$rows_left_out":31}
{"sheet":"MARx","index":8,"n_rows":45,"n_cols":20,"rows_kept":45,"cut":false,"hidden":false,"merged":[]}
["Maximum Allowable Revenue (MAR) Module"]
[]
[]
[null,null,null,null,null,"CPP Regulatory Period"]
[null,null,null,null,null,{"$f":"Inputs!F5","v":2019},{"$f":"Inputs!G5","v":2020},{"$f":"Inputs!H5","v":2021},{"$f":"Inputs!I5","v":2022},{"$f":"Inputs!J5","v":2023},"Input reference"]
[]
["Maximum Allowable Revenue Before Tax (MAR Before Tax)"]
[]
["Prior year's MAR",null,null,null,null,null,{"$f":"F12","v":278558.7435040308},{"$f":"G12","v":284555.77752956259},{"$f":"H12","v":290523.59645918169},{"$f":"I12","v":296414.40781771886},"CALC"]
["multiply by (1 + ΔCPI)",null,null,null,null,null,{"$f":"1+Inputs!G12","v":1.021528794788827},{"$f":"1+Inputs!H12","v":1.0209724047124613},{"$f":"1+Inputs!I12","v":1.0202765332328689},{"$f":"1+Inputs!J12","v":1.0200000000000002},"INPUT7 | CALC"]
["multiply by (1 - X)",null,null,null,null,null,{"$f":"1-Inputs!$C$8","v":1},{"$f":"1-Inputs!$C$8","v":1},{"$f":"1-Inputs!$C$8","v":1},{"$f":"1-Inputs!$C$8","v":1},"INPUT3 | CALC"]
["MAR before tax",null,null,null,null,278558.7435040308,{"$f":"G9*G10*G11","v":284555.77752956259},{"$f":"H9*H10*H11","v":290523.59645918169},296414.40781771886,302342.69597407331,"CALC"]
[]
["Maximum Allowable Revenue After Tax (MAR After Tax)"]
[]
{"$rows_left_out":31}
{"sheet":"Output","index":9,"n_rows":12,"n_cols":11,"rows_kept":12,"cut":false,"hidden":false,"merged":[]}
["CPP Outputs Module"]
[]
[]
[null,null,null,"Assessment Period",null,"CPP Regulatory Period"]
["Ref.","Output Name","Discrete Output",{"$f":"Inputs!D5","v":2017},{"$f":"Inputs!E5","v":2018},{"$f":"Inputs!F5","v":2019},{"$f":"Inputs!G5","v":2020},{"$f":"Inputs!H5","v":2021},{"$f":"Inputs!I5","v":2022},{"$f":"Inputs!J5","v":2023},"Description"]
["OUT1","CPP regulatory period",null,null,null,{"$f":"Inputs!F5","v":2019},{"$f":"Inputs!G5","v":2020},{"$f":"Inputs!H5","v":2021},{"$f":"Inputs!I5","v":2022},{"$f":"Inputs!J5","v":2023},"The period of continuous disclosure years in respect of which the customised price-quality path applies, and which follows the assessment period."]
["OUT2","Allowed Controllable Opex",null,null,null,{"$f":"Inputs!F7","v":0},{"$f":"Inputs!G7","v":0},{"$f":"Inputs!H7","v":0},{"$f":"Inputs!I7","v":0},{"$f":"Inputs!J7","v":0},"A series of values ($000) for the CPP regulatory period where a single value for a disclosure year represents the allowance for operating expenditure for that year in categories specified by the Commission as controllable by the supplier."]
["OUT3","Building Blocks Allowable Revenue Before Tax",null,{"$f":"BBARx!D33","v":235275.12995789654},{"$f":"BBARx!E33","v":242827.41188612202},{"$f":"BBARx!F33","v":264912.35356679867},{"$f":"BBARx!G33","v":285860.65221659816},{"$f":"BBARx!H33","v":290090.98102031648},{"$f":"BBARx!I33","v":301582.78069818881},{"$f":"BBARx!J33","v":313438.76324663212},"A series of values ($000) for the next period where a single value for a disclosure year represents the revenue required to be generated by a supplier in that year in compensate it for its economic costs for that year expressed in nominal terms and excluding claw-back or pass through or recoverable costs."]
["OUT4","Building Blocks Allowable Revenue After Tax",null,{"$f":"BBARx!D39","v":215267.06097903237},{"$f":"BBARx!E39","v":222032.24863585623},{"$f":"BBARx!F39","v":242134.03864462703},{"$f":"BBARx!G39","v":260814.06767206825},{"$f":"BBARx!H39","v":265311.59429833852},{"$f":"BBARx!I39","v":275077.4402292546},{"$f":"BBARx!J39","v":285350.83010221535},"A series of values ($000) for the next period where a single value for a disclosure year represents the Building Blocks Allowable Revenue Before Tax less the forecast regulatory tax allowance for that year."]
["OUT5","Maximum Allowable Revenue Before Tax",null,null,null,{"$f":"MARx!F12","v":278558.7435040308},{"$f":"MARx!G12","v":284555.77752956259},{"$f":"MARx!H12","v":290523.59645918169},{"$f":"MARx!I12","v":296414.40781771886},{"$f":"MARx!J12","v":302342.69597407331},"A series of values ($000) which determine the  revenue path for a supplier for the CPP regulatory period whereby a single value for a disclosure year represents the maximum allowable revenue in nominal terms that the supplier may recover from customers through prices for that year allowing for claw-back amounts, and net of pass through costs and recoverable costs."]
["OUT6","Maximum Allowable Revenue After Tax",null,null,null,{"$f":"MARx!F16-MARx!F17","v":255780.42858185916},{"$f":"MARx!G16-MARx!G17","v":259509.19298503269},{"$f":"MARx!H16-MARx!H17","v":265744.20973720372},{"$f":"MARx!I16-MARx!I17","v":269909.06734878465},{"$f":"MARx!J16-MARx!J17","v":274254.76282965654},"A series of values ($000) for the CPP regulatory period where a single value for a disclosure year represents the maximum allowable revenue that the supplier may recover through prices for that year, less a forecast amount of tax."]
["OUT7","‘X’ factor",{"$f":"Inputs!C8","v":0},null,null,null,null,null,null,null,"A single value (percentage 3 d.p.) representing the rate of change allowed for the maximum allowable revenue path where the path is expressed in ‘CPI-X’ terms."]