{"text_format":"1","workbook":"xlsx","n_sheets":21,"sheets":["CoverSheet","Description","Table of Contents","Inputs_AS","Existing","Additional","OpexTax","Total","Inputs_finmod","GPB data","Timing","RAB","Tax","BBAR","Rev","MAR","Reporting","Dashboard","Deferred Action","AS Decision DPP3","Outputs to Chartbook"],"not_rendered":{"charts":33,"images":2,"macros":1,"external_links":6,"defined_names":91,"comments":0,"pivot_tables":0},"unopened":[],"bounds":{"document_bytes":16777216,"sheet_cells":100000,"rows_first":2000,"rows_last":500,"rows_between":2000,"halvings":0,"cell_chars":16384,"cell_head_chars":4096},"cells_cut":0,"cells_raw":0,"read":"whole","date_system":"1900"}

{"sheet":"CoverSheet","index":0,"n_rows":17,"n_cols":1,"rows_kept":17,"cut":false,"hidden":false,"merged":[]}
[]
[]
["Gas Pipeline Businesses"]
["Price-Quality Regulation 1 October 2022 Reset"]
["Default Price Path Asset Stranding Model"]
[]
[]
[]
[]
[]
{"$rows_left_out":8}
{"sheet":"Description","index":1,"n_rows":20,"n_cols":2,"rows_kept":20,"cut":false,"hidden":false,"merged":[]}
["Description"]
["How this workbook may be operated"]
[1,"Update a particular case,i.e, for a chosen GPB and chosen stranding year"]
[null,"Select the case using the Dashboard tab by selecting GPB, Stranding Year, Years in MAR ramp-up, Stranding Year MAR ÷ 2023 MAR, Revaluations, Curve on MAR ramp-down"]
[null,"After making the selections on the dashboard, run the macro \"Update results for one selected case and GPB \". This runs the GoallSeeks macro, which updates the results on the tab Dashboard. Until this macro is run, the Dashboard results will most likely be invalid."]
[null,"Results may be observed on the charts on the dashboard and also values in sheets from Existing  to MAR will be relevant to the selected case and GPB."]
[2,"Update results for selected case and all Stranding Years and all GPBs"]
[null,"This macro can be run by button \" Update summary table for all GPBs\" on the Dashboard sheet or \"Update Summary Table\" on Reporting sheet.  They key parameters are Years of ramp-up, Stranding Year, MAR of 2023 MAR, Curve on MAR ramp-down and Revaluations as the macro will step through all combinations of the five GPBs and five stranding years anyway, ie, 25 different cases."]
[null,"The populated results appear in sheet Reporting under the label \"Summary Table\""]
[3,"Defer Mitigation until DPP4"]
{"$rows_left_out":11}
{"sheet":"Table of Contents","index":2,"n_rows":53,"n_cols":3,"rows_kept":53,"cut":false,"hidden":false,"merged":[]}
["Table of Contents"]
[]
[]
[null,"Sheet Name","Link"]
[null,"Inputs_AS","Inputs"]
[null,"Existing","Existing assets"]
[null,null,"Inputs"]
[null,null,"Calculations"]
[null,"Additional","Additional assets"]
[null,"OpexTax","Opex and Tax"]
{"$rows_left_out":44}
{"sheet":"Inputs_AS","index":3,"n_rows":139,"n_cols":54,"rows_kept":139,"cut":false,"hidden":false,"merged":[]}
["Inputs"]
[null,"Chosen supplier",null,{"$f":"GPB_name","v":"First Gas transmission"}]
[null,"Chosen supplier number",null,{"$f":"MATCH(GPB_name,GPBnames,0)","v":5}]
[null,"Post-tax WACC",null,5.67E-2,"Please change the Inputs highlighted in red only, the Input values in black are either Macro driven or linked to tab Dashboard."]
[null,"Vanilla WACC",null,6.1400000000000003E-2,"Use tab Dashboard to select Modelling Inputs criteria."]
[null,"Cost of debt",null,4.0399999999999998E-2]
[null,"Leverage",null,0.42]
[null,"Tax rate",null,0.28000000000000003]
[null,"Stranding year opex÷2027 opex",null,0.3]
[null,"Stranding year",null,{"$f":"StrandingYear","v":2060}]
{"$rows_left_out":130}
{"sheet":"Existing","index":4,"n_rows":88,"n_cols":56,"rows_kept":88,"cut":false,"hidden":false,"merged":[]}
["Existing assets"]
["Inputs"]
[null,"Chosen Supplier",null,{"$f":"GPB_name","v":"First Gas transmission"}]
[null,"Mitigation",null,{"$f":"Inputs_AS!D15","v":true}]
[null,"Stranding year",null,{"$f":"Inputs_AS!D10","v":2060}]
[null,"Adjustment Factor",null,{"$f":"AdjFactor","v":0.90894405901017006}]
[null,"Apply revaluations from 2023 onwards",null,{"$f":"Reval","v":true}]
[]
[null,"Forecast changes in CPI used for revaluations"]
[null,null,null,null,2021,2022,2023,2024,2025,2026,2027,2028,2029,2030,2031,2032,2033,2034,2035,2036,2037,2038,2039,2040,2041,2042,2043,2044,2045,2046,2047,2048,2049,2050,2051,2052,2053,2054,2055,2056,2057,2058,2059,2060,2061,2062,2063,2064,2065,2066,2067,2068,2069,2070,2071,2072]
{"$rows_left_out":79}
{"sheet":"Additional","index":5,"n_rows":131,"n_cols":56,"rows_kept":131,"cut":false,"hidden":false,"merged":[]}
["Additional assets"]
["Inputs"]
[null,"Chosen supplier",null,{"$f":"Inputs_AS!D2","v":"First Gas transmission"},"Timing of \"additional assets\" against the timeliine: In this workbook, additional assets"]
[null,"Chosen supplier number",null,{"$f":"Inputs_AS!D3","v":5},"are recorded as occurring in the year in which they enter the RAB. This is the year after"]
[null,"Post-tax WACC",null,{"$f":"Inputs_AS!D5","v":6.1400000000000003E-2},"the year during which they are dommissioned."]
[null,"Stranding year",null,{"$f":"Inputs_AS!D10","v":2060}]
[null,"Adjustment factor",null,{"$f":"AdjFactor","v":0.90894405901017006}]
[null,"Remaining life of additional assets, Business As Usual (BAU)",null,{"$f":"Inputs_AS!D12","v":45}]
[null,"Mitigation",null,{"$f":"Mitigation","v":true}]
[null,"Stranding year BBAR ÷ 2023 BBAR",null,{"$f":"Inputs_AS!D13","v":0.2}]
{"$rows_left_out":122}
{"sheet":"OpexTax","index":6,"n_rows":19,"n_cols":52,"rows_kept":19,"cut":false,"hidden":false,"merged":[]}
["Opex and Tax"]
["Inputs"]
[null,"Chosen supplier",{"$f":"GPB_name","v":"First Gas transmission"}]
[null,"Supplier number",{"$f":"SupplierNum","v":5}]
[null,"Stranding Year",{"$f":"Inputs_AS!D10","v":2060}]
[null,"2026 & 2027 opex",{"$f":"Inputs_finmod!K49","v":58465.281875978297}]
[null,"Stranding year opex÷2027 opex",{"$f":"Inputs_AS!D9","v":0.3}]
[null,"Stranding year opex",{"$f":"C6*C7","v":17539.584562793487}]
[null,"Annual opex decrement",{"$f":"(C6-C8)/(C5-2027)","v":1240.172645854085}]
[null,"Opening regulatory tax asset value, 2021",{"$f":"Tax!D106","v":205340.13392639998}]
{"$rows_left_out":10}
{"sheet":"Total","index":7,"n_rows":86,"n_cols":53,"rows_kept":86,"cut":false,"hidden":false,"merged":[]}
["Total"]
["Inputs"]
[null,"Chosen supplier",{"$f":"Inputs_AS!D2","v":"First Gas transmission"}]
[null,"Chosen supplier number",{"$f":"Inputs_AS!D3","v":5}]
[null,"Post-tax WACC",5.67E-2]
[null,"Vanilla WACC",6.1400000000000003E-2]
[null,"Cost of debt",4.0399999999999998E-2]
[null,"Leverage",{"$f":"Inputs_AS!D7","v":0.42}]
[null,"Tax rate",{"$f":"Inputs_AS!D8","v":0.28000000000000003}]
[null,"Stranding year",{"$f":"Inputs_AS!D10","v":2060}]
{"$rows_left_out":77}
{"sheet":"Inputs_finmod","index":8,"n_rows":85,"n_cols":11,"rows_kept":85,"cut":false,"hidden":false,"merged":[]}
["Inputs","Values, not time series","Early base year","Standard base year","Gap year","1st BBAR year","2nd BBAR year","3rd BBAR year","4th BBAR year","5th BBAR year"]
["All input data is entered into this worksheet.","Exceptions to the principle that an inputs sheet should not include anything other than inputs have this grey background."]
["Name of supplier currently chosen as the focus of this workbook",null,{"$f":"GPB_name","v":"First Gas transmission"}]
["Supplier number (inferred from chosen name above)",null,{"$f":"HLOOKUP(GPB_name,Inputs_finmod!$B$21:$F$22,2,FALSE)","v":5}]
[]
["Inputs that are the same for all suppliers"]
["BBAR year ending in calendar year:",null,{"$f":"D7-1","v":2020},{"$f":"E7-1","v":2021},{"$f":"F7-1","v":2022},2023,{"$f":"F7+1","v":2024},{"$f":"G7+1","v":2025},{"$f":"H7+1","v":2026},{"$f":"I7+1","v":2027}]
["Forecast changes in CPI used for revaluations, June year-ends",null,null,{"$f":"[1]Output!G8","v":3.3428844317096473E-2},{"$f":"[1]Output!H8","v":6.2999999999999945E-2},{"$f":"[1]Output!I8","v":2.6000000000000023E-2},{"$f":"[1]Output!J8","v":2.2999999999999909E-2},{"$f":"[1]Output!K8","v":2.0000000000000018E-2},{"$f":"[1]Output!L8","v":2.0000000000000018E-2},{"$f":"[1]Output!M8","v":2.0000000000000018E-2}]
["Forecast changes in CPI used for revaluations, September year-ends",null,null,{"$f":"[1]Output!G9","v":4.933586337760909E-2},{"$f":"[1]Output!H9","v":5.0000000000000044E-2},{"$f":"[1]Output!I9","v":2.4999999999999911E-2},{"$f":"[1]Output!J9","v":2.200000000000002E-2},{"$f":"[1]Output!K9","v":2.0000000000000018E-2},{"$f":"[1]Output!L9","v":2.0000000000000018E-2},{"$f":"[1]Output!M9","v":2.0000000000000018E-2}]
["Forecast changes in the CPI element of the price path",null,null,{"$f":"IF($C$3=\"First Gas Transmission\",[1]Output!G11,[1]Output!G10)","v":2.811532046700016E-2},{"$f":"IF($C$3=\"First Gas Transmission\",[1]Output!H11,[1]Output!H10)","v":5.9549015063731225E-2},{"$f":"IF($C$3=\"First Gas Transmission\",[1]Output!I11,[1]Output!I10)","v":3.0921227991357547E-2},{"$f":"IF($C$3=\"First Gas Transmission\",[1]Output!J11,[1]Output!J10)","v":2.3244538463801812E-2},{"$f":"IF($C$3=\"First Gas Transmission\",[1]Output!K11,[1]Output!K10)","v":2.0247991487292172E-2},{"$f":"IF($C$3=\"First Gas Transmission\",[1]Output!L11,[1]Output!L10)","v":2.000000000000024E-2},{"$f":"IF($C$3=\"First Gas Transmission\",[1]Output!M11,[1]Output!M10)","v":2.0000000000000018E-2}]
{"$rows_left_out":76}
{"sheet":"GPB data","index":9,"n_rows":90,"n_cols":10,"rows_kept":90,"cut":false,"hidden":false,"merged":[]}
["GPB data","Values, not time series","Early base year","Standard base year","Gap year","1st BBAR year","2nd BBAR year","3rd BBAR year","4th BBAR year","5th BBAR year"]
["Data from the Inputs sheet that relates to the selected supplier. The supplier's name is user-selected in cell C3 on the Inputs sheet.",null,{"$f":" TEXT(EOMONTH($B$17+1,-25)+1,\"dd.mm.yy\")  & \" to \" & TEXT(EOMONTH($B$17,-12),\"dd.mm.yy\")","v":"01.10.19 to 30.09.20"},{"$f":" TEXT(EOMONTH($B$17+1,-13)+1,\"dd.mm.yy\")  & \" to \" & TEXT(EOMONTH($B$17,0),\"dd.mm.yy\")","v":"01.10.20 to 30.09.21"},{"$f":" TEXT(EOMONTH($B$17+1,-1)+1,\"dd.mm.yy\")  & \" to \" & TEXT(EOMONTH($B$17,12),\"dd.mm.yy\")","v":"01.10.21 to 30.09.22"},{"$f":" TEXT(EOMONTH($B$17+1,11)+1,\"dd.mm.yy\")  & \" to \" & TEXT(EOMONTH($B$17,24),\"dd.mm.yy\")","v":"01.10.22 to 30.09.23"},{"$f":" TEXT(EOMONTH($B$17+1,23)+1,\"dd.mm.yy\")  & \" to \" & TEXT(EOMONTH($B$17,36),\"dd.mm.yy\")","v":"01.10.23 to 30.09.24"},{"$f":" TEXT(EOMONTH($B$17+1,35)+1,\"dd.mm.yy\")  & \" to \" & TEXT(EOMONTH($B$17,48),\"dd.mm.yy\")","v":"01.10.24 to 30.09.25"},{"$f":" TEXT(EOMONTH($B$17+1,47)+1,\"dd.mm.yy\")  & \" to \" & TEXT(EOMONTH($B$17,60),\"dd.mm.yy\")","v":"01.10.25 to 30.09.26"},{"$f":" TEXT(EOMONTH($B$17+1,59)+1,\"dd.mm.yy\")  & \" to \" & TEXT(EOMONTH($B$17,72),\"dd.mm.yy\")","v":"01.10.26 to 30.09.27"}]
["Supplier",null,null,null,null,null,null,null,null,{"$f":"GPB_name","v":"First Gas transmission"}]
["Supplier number",null,{"$f":"Inputs_finmod!C4","v":5}]
["General data"]
["Non business-specific single inputs"]
[{"$f":"Inputs_finmod!A15","v":"Vanilla WACC (67th percentile)"},{"$f":"Inputs_finmod!B15","v":6.1400000000000003E-2}]
[{"$f":"Inputs_finmod!A16","v":"Cost of debt"},{"$f":"Inputs_finmod!B16","v":4.0399999999999998E-2}]
[{"$f":"Inputs_finmod!A17","v":"Leverage"},{"$f":"Inputs_finmod!B17","v":0.42}]
[{"$f":"Inputs_finmod!A18","v":"Remaining asset life for additional assets before adjustment"},{"$f":"Inputs_finmod!B18","v":45},"years"]
{"$rows_left_out":81}
{"sheet":"Timing","index":10,"n_rows":32,"n_cols":10,"rows_kept":32,"cut":false,"hidden":false,"merged":[]}
["Timing",null,null,null,null,"1st BBAR year","2nd BBAR year","3rd BBAR year","4th BBAR year","5th BBAR year"]
["Calculations related to timing",null,null,null,null,null,null,null,null,{"$f":"GPB_name","v":"First Gas transmission"}]
["Inputs"]
["Days from mid-year to year-end",null,{"$f":"'GPB data'!B12","v":182}]
["Days from revenue date to year-end",null,{"$f":"'GPB data'!B13","v":148}]
["Vanilla WACC (67th percentile)",null,{"$f":"WACC","v":6.1400000000000003E-2}]
[{"$f":"'GPB data'!A17","v":"Last day in the standard base year"},null,{"$f":"'GPB data'!B17","v":"2021-09-30"}]
[{"$f":"'GPB data'!A14","v":"Day prior to start of the regulatory period"},null,{"$f":"'GPB data'!B14","v":"2022-09-30"}]
["Calculations"]
["Year-end of 1st BBAR year",null,{"$f":"EOMONTH(C7,24)","v":"2023-09-30"}]
{"$rows_left_out":23}
{"sheet":"RAB","index":11,"n_rows":105,"n_cols":10,"rows_kept":105,"cut":false,"hidden":false,"merged":[]}
["Regulatory asset base","Values, not time series","Early base year","Standard base year","Gap year","1st BBAR year","2nd BBAR year","3rd BBAR year","4th BBAR year","5th BBAR year"]
["Calculations relating to RAB values for full years"]
["Inputs",null,null,null,null,null,null,null,null,{"$f":"GPB_name","v":"First Gas transmission"}]
["BBAR year ending in calendar year:",null,{"$f":"'GPB data'!C18","v":2020},{"$f":"'GPB data'!D18","v":2021},{"$f":"'GPB data'!E18","v":2022},{"$f":"'GPB data'!F18","v":2023},{"$f":"'GPB data'!G18","v":2024},{"$f":"'GPB data'!H18","v":2025},{"$f":"'GPB data'!I18","v":2026},{"$f":"'GPB data'!J18","v":2027}]
["Opening RAB",null,{"$f":"'GPB data'!C32","v":"~"},{"$f":"'GPB data'!D32","v":849688.09291020641}]
["Total depreciation",null,{"$f":"'GPB data'!C33","v":"~"},{"$f":"'GPB data'!D33","v":34267.213736700003}]
["Closing RAB",null,{"$f":"'GPB data'!C34","v":"~"},{"$f":"'GPB data'!D34","v":874464.59547156945}]
["Value of disposed assets",null,null,{"$f":"'GPB data'!D82","v":1634.3483787999999},{"$f":"'GPB data'!E82","v":466.06175750051341},{"$f":"'GPB data'!F82","v":477.71330143802624},{"$f":"'GPB data'!G82","v":488.22299406966283},{"$f":"'GPB data'!H82","v":497.98745395105612},{"$f":"'GPB data'!I82","v":507.94720303007728},{"$f":"'GPB data'!J82","v":518.10614709067886}]
["Value of commissioned assets",null,null,{"$f":"'GPB data'!D71","v":18812.792070000003},{"$f":"'GPB data'!E71","v":37106.20044752895},{"$f":"'GPB data'!F71","v":40302.49785512466},{"$f":"'GPB data'!G71","v":47383.78588481043},{"$f":"'GPB data'!H71","v":40281.496689504704},{"$f":"'GPB data'!I71","v":42695.221917363131},{"$f":"'GPB data'!J71","v":45010.918808408438}]
["Remaining life for additional assets before adjustment factor",{"$f":"'GPB data'!B10","v":45}]
{"$rows_left_out":96}
{"sheet":"Tax","index":12,"n_rows":107,"n_cols":10,"rows_kept":107,"cut":false,"hidden":false,"merged":[]}
["Tax calculations","Values, not time series","Early base year","Standard base year","Gap year","1st BBAR year","2nd BBAR year","3rd BBAR year","4th BBAR year","5th BBAR year"]
["Calculation of adjusted depreciation, tax depreciation, deferred tax, notional deductible interest and regulatory tax adjustments."]
["Inputs",null,null,null,null,null,null,null,null,{"$f":"GPB_name","v":"First Gas transmission"}]
["BBAR year ending in calendar year:",null,{"$f":"'GPB data'!C18","v":2020},{"$f":"'GPB data'!D18","v":2021},{"$f":"'GPB data'!E18","v":2022},{"$f":"'GPB data'!F18","v":2023},{"$f":"'GPB data'!G18","v":2024},{"$f":"'GPB data'!H18","v":2025},{"$f":"'GPB data'!I18","v":2026},{"$f":"'GPB data'!J18","v":2027}]
["Corporate tax rate",null,{"$f":"'GPB data'!C22","v":0.28000000000000003},{"$f":"'GPB data'!D22","v":0.28000000000000003},{"$f":"'GPB data'!E22","v":0.28000000000000003},{"$f":"'GPB data'!F22","v":0.28000000000000003},{"$f":"'GPB data'!G22","v":0.28000000000000003},{"$f":"'GPB data'!H22","v":0.28000000000000003},{"$f":"'GPB data'!I22","v":0.28000000000000003},{"$f":"'GPB data'!J22","v":0.28000000000000003}]
["Value of commissioned assets",null,{"$f":"'GPB data'!C71","v":0},{"$f":"'GPB data'!D71","v":18812.792070000003},{"$f":"'GPB data'!E71","v":37106.20044752895},{"$f":"'GPB data'!F71","v":40302.49785512466},{"$f":"'GPB data'!G71","v":47383.78588481043},{"$f":"'GPB data'!H71","v":40281.496689504704},{"$f":"'GPB data'!I71","v":42695.221917363131},{"$f":"'GPB data'!J71","v":45010.918808408438}]
["Remaining life for additional assets",null,null,{"$f":"RAB!D32","v":45},{"$f":"RAB!E32","v":44},{"$f":"RAB!F32","v":39.084594537437312},{"$f":"RAB!G32","v":38.084594537437312},{"$f":"RAB!H32","v":37.084594537437312},{"$f":"RAB!I32","v":36.084594537437312},{"$f":"RAB!J32","v":35.084594537437312}]
["Amortisation of initial differences in asset values",{"$f":"'GPB data'!B41","v":0}]
["Value of disposed assets",null,null,{"$f":"'GPB data'!D82","v":1634.3483787999999},{"$f":"'GPB data'!E82","v":466.06175750051341},{"$f":"'GPB data'!F82","v":477.71330143802624},{"$f":"'GPB data'!G82","v":488.22299406966283},{"$f":"'GPB data'!H82","v":497.98745395105612},{"$f":"'GPB data'!I82","v":507.94720303007728},{"$f":"'GPB data'!J82","v":518.10614709067886}]
["Opening RAB excluding revaluations",null,{"$f":"'GPB data'!C35","v":"~"},{"$f":"'GPB data'!D35","v":0}]
{"$rows_left_out":98}
{"sheet":"BBAR","index":13,"n_rows":95,"n_cols":10,"rows_kept":95,"cut":false,"hidden":false,"merged":[]}
["Building blocks allowable revenue","Values, not time series","Early base year","Std base year","Gap year","1st BBAR year","2nd BBAR year","3rd BBAR year","4th BBAR year","5th BBAR year"]
["Calculation of BBAR present value, opening investment value, and TCSD allowance."]
["Inputs",null,null,null,null,null,null,null,null,{"$f":"GPB_name","v":"First Gas transmission"}]
["Tax payable (payable) or deferred tax (deferred)",{"$f":"'GPB data'!B27","v":"payable"}]
["Vanilla WACC (67th percentile)",{"$f":"WACC","v":6.1400000000000003E-2}]
["Term credit spread differential allowance",null,{"$f":"'GPB data'!C39","v":"~"},{"$f":"'GPB data'!D39","v":1271.2165374407055}]
["BBAR year ending in calendar year:",null,null,{"$f":"'GPB data'!D18","v":2021},{"$f":"'GPB data'!E18","v":2022},{"$f":"'GPB data'!F18","v":2023},{"$f":"'GPB data'!G18","v":2024},{"$f":"'GPB data'!H18","v":2025},{"$f":"'GPB data'!I18","v":2026},{"$f":"'GPB data'!J18","v":2027}]
["Corporate tax rate",null,null,null,null,{"$f":"'GPB data'!F22","v":0.28000000000000003},{"$f":"'GPB data'!G22","v":0.28000000000000003},{"$f":"'GPB data'!H22","v":0.28000000000000003},{"$f":"'GPB data'!I22","v":0.28000000000000003},{"$f":"'GPB data'!J22","v":0.28000000000000003}]
["Other regulated income",null,null,null,null,{"$f":"'GPB data'!F90","v":0},{"$f":"'GPB data'!G90","v":0},{"$f":"'GPB data'!H90","v":0},{"$f":"'GPB data'!I90","v":0},{"$f":"'GPB data'!J90","v":0}]
[]
{"$rows_left_out":86}
{"sheet":"Rev","index":14,"n_rows":27,"n_cols":9,"rows_kept":27,"cut":false,"hidden":false,"merged":[]}
["Revenue growth index",null,null,"Values, not time series",null,"1st revenue year","2nd revenue year","3rd revenue year","4th revenue year"]
["Calculation of the normalised profile of the maximum allowable revenue before tax values.",null,null,null,null,null,null,null,{"$f":"GPB_name","v":"First Gas transmission"}]
["Inputs"]
["Pricing year ending in calendar year:",null,null,null,2022,2023,2024,2025,2026]
["Constant price revenue growth",null,null,null,null,null,{"$f":"'GPB data'!G61","v":0},{"$f":"'GPB data'!H61","v":0},{"$f":"'GPB data'!I61","v":0}]
["Industry-wide X factor",null,null,{"$f":"'GPB data'!B11","v":0}]
["Alternative X factor",null,null,{"$f":"'GPB data'!B43","v":-4.85630403139483E-2}]
[]
["Forecast changes in the CPI element of the price path, no lag",null,null,null,null,null,{"$f":"'GPB data'!G21","v":2.3244538463801812E-2},{"$f":"'GPB data'!H21","v":2.0247991487292172E-2},{"$f":"'GPB data'!I21","v":2.000000000000024E-2}]
["Total revenue cap (TRC) or weighted average price cap (WAPC)",null,null,{"$f":"'GPB data'!B28","v":"TRC_FQ"}]
{"$rows_left_out":18}
{"sheet":"MAR","index":15,"n_rows":72,"n_cols":9,"rows_kept":72,"cut":false,"hidden":false,"merged":[]}
["Maximum allowable revenue",null,"Values, not time series",null,null,"1st Revenue year","2nd Revenue year","3rd Revenue year","4th Revenue year"]
["Calculation of starting prices.",null,null,null,null,null,null,null,{"$f":"GPB_name","v":"First Gas transmission"}]
["Inputs"]
["Pricing year ending in calendar year:",null,null,null,null,2023,2024,2025,2026]
["Year in regulatory period",null,null,null,null,1,{"$f":"F5+1","v":2},{"$f":"G5+1","v":3},{"$f":"H5+1","v":4}]
["Industry-wide X factor",null,{"$f":"Inputs_finmod!B19","v":0}]
["Alternative X factor",null,{"$f":"'GPB data'!B43","v":-4.85630403139483E-2}]
["Vanilla WACC (67th percentile)",null,{"$f":"WACC","v":6.1400000000000003E-2}]
["TFrev",null,{"$f":"Timing!C27","v":1.0244562975994667}]
["Constant price revenue growth in year ending 2022",null,{"$f":"'GPB data'!E61","v":0}]
{"$rows_left_out":63}
{"sheet":"Reporting","index":16,"n_rows":194,"n_cols":53,"rows_kept":194,"cut":false,"hidden":false,"merged":[]}
["Reporting"]
[]
[null,"Update Summary Table results for all GPBs"]
[null,"Final Decision blending"]
[null,"Deferred Mitigation results"]
[null,"Calculate unrecovered RAB for unmitigated stranding risk"]
[null,"Residual Value"]
[]
["Summary Table"]
[null,"The table below is updated by CalcMainTables Macro, factoring in paramaters selected on tab Dashboard. Button for refresh can be found just above and also in the tab Dashboard."]
{"$rows_left_out":185}
{"sheet":"Dashboard","index":17,"n_rows":33,"n_cols":7,"rows_kept":33,"cut":false,"hidden":false,"merged":[]}
["Dashboard"]
["Case selection",null,null,null,null,null,"Charts"]
[null,"Chosen supplier","First Gas transmission"]
[null,"Stranding year",2060]
[null,"Years in MAR ramp-up",6]
[null,"MAR ramp-down start",{"$f":"IF(RampUpYears=9,2031,IF(RampUpYears=8,2030,IF(RampUpYears=14,2036,2029)))","v":2029}]
[null,"Stranding year MAR ÷ 2023 MAR",0.2]
[null,"Apply revals from 2023",true]
[null,"Curve on MAR ramp-down",0.02]
[]
{"$rows_left_out":24}
{"sheet":"Deferred Action","index":18,"n_rows":60,"n_cols":6,"rows_kept":60,"cut":false,"hidden":false,"merged":[]}
["Dashboard for deferred mitigation"]
[]
[]
[null,"Allows to select different set of assumptions for mitigation in DPP3 and deferred mitigation in DPP4 "]
[]
[null,"Parameters selection",null,"Mitigation DPP3",null,"Mitigation DPP4"]
[null,"Stranding year",null,2060,null,2060]
[null,"Years in MAR ramp-up",null,6,null,6]
[null,"MAR ramp-down start",null,{"$f":"IF(RampUpYearsDPP3=9,2031,IF(RampUpYearsDPP3=8,2030,IF(RampUpYearsDPP3=14,2036,2029)))","v":2029},null,{"$f":"IF(RampUpYearsDPP4=9,2031,IF(RampUpYearsDPP4=8,2030,IF(RampUpYearsDPP4=14,2036,2029)))","v":2029}]
[null,"Stranding year MAR ÷ 2023 MAR",null,0.2,null,0.2]
{"$rows_left_out":51}
{"sheet":"AS Decision DPP3","index":19,"n_rows":37,"n_cols":11,"rows_kept":37,"cut":false,"hidden":false,"merged":[[13,6,14,6],[13,7,14,7],[12,2,12,3],[12,4,12,5],[12,6,12,7],[13,2,13,3],[13,4,13,5]]}
["Asset Stranding Decision DPP3"]
[]
[]
[]
[null,"Updates results on this tab for decision by Commerce Commission"]
[]
[null,"Parameters for Final decision"]
[null,"Stranding Year","MAR ramp-up years","MAR ramp-down start","MAR in last year ÷ 2023 MAR","Curve on MAR ramp-down","Weight allocated"]
[null,{"$f":"Reporting!B42","v":2050},{"$f":"Reporting!C42","v":6},{"$f":"Reporting!D42","v":2029},{"$f":"Reporting!E42","v":0.2},{"$f":"Reporting!F42","v":0},0.33]
[null,{"$f":"Reporting!B53","v":2060},{"$f":"Reporting!C53","v":6},{"$f":"Reporting!D53","v":2029},{"$f":"Reporting!E53","v":0.2},{"$f":"Reporting!F53","v":0.02},0.67]
{"$rows_left_out":28}
{"sheet":"Outputs to Chartbook","index":20,"n_rows":58,"n_cols":40,"rows_kept":58,"cut":false,"hidden":false,"merged":[]}
["Outputs to chartbook"]
[]
["Chapter 6, Attachment C, Attachment D"]
[]
["Table 6.5"]
["Supplier","Revenue increase from shortening asset lives","Revenue increase due to other factors","Total revenue increase (Capped at 10% real and rounded to nearest 0.5%)"]
["GasNet",{"$f":"D7-C7","v":2.1916778179672081E-2},{"$f":"[2]Outputs!$C$38*-1","v":3.3078020680811004E-2},{"$f":"([6]Outputs!$C$50)/-1","v":5.4994798860483085E-2}]
["Powerco",{"$f":"D8-C8","v":2.843415557975737E-2},{"$f":"([2]Outputs!$D$38)/-1","v":2.1565886618411634E-2},{"$f":"([6]Outputs!$D$50)/-1","v":5.0000042198169004E-2}]
["Vector",{"$f":"D9-C9","v":6.1769344541794835E-2},{"$f":"([2]Outputs!$E$38)/-1","v":-3.1769379404887665E-2},{"$f":"([6]Outputs!$E$50)/-1","v":2.999996513690717E-2}]
["First Gas distribution",{"$f":"D10-C10","v":5.2599059466155618E-2},{"$f":"([2]Outputs!$F$38)/-1","v":4.7400941090835369E-2},{"$f":"([6]Outputs!$F$50)/-1","v":0.10000000055699099}]
{"$rows_left_out":48}