{"text_format":"1","workbook":"xlsx","n_sheets":15,"sheets":["CoverSheet","Description","Table of Contents","Waterfall","DetailsOfChanges","WfallCht","Inputs","EDB data","TIMING","RAB","TAX","BBAR","REV","MAR","Reconciliation"],"not_rendered":{"charts":3,"images":18,"macros":1,"external_links":2,"defined_names":36,"comments":2,"pivot_tables":0},"unopened":[],"bounds":{"document_bytes":16777216,"sheet_cells":100000,"rows_first":2000,"rows_last":500,"rows_between":2000,"halvings":0,"cell_chars":16384,"cell_head_chars":4096},"cells_cut":0,"cells_raw":0,"read":"whole","date_system":"1900"}

{"sheet":"CoverSheet","index":0,"n_rows":17,"n_cols":1,"rows_kept":17,"cut":false,"hidden":false,"merged":[]}
[]
[]
["Electricity Distribution Business"]
["Price-Quality Regulation 1 April 2020 DPP Reset"]
["MAR waterfall model (draft to final)"]
["Final determination"]
[]
[]
[]
[]
{"$rows_left_out":8}
{"sheet":"Description","index":1,"n_rows":90,"n_cols":3,"rows_kept":90,"cut":false,"hidden":false,"merged":[[89,2,90,5],[23,2,23,5],[17,2,17,5],[20,2,20,5],[16,2,16,5],[67,2,67,5],[68,2,68,5],[63,2,63,5],[53,2,53,5],[55,2,55,5],[56,2,56,5],[57,2,57,5],[58,2,58,5],[59,2,59,5],[60,2,60,5],[61,2,61,5],[12,1,12,5],[18,2,18,5],[19,2,19,5],[49,2,49,5],[51,2,51,5],[50,2,50,5],[62,2,62,5],[64,2,64,5],[65,2,65,5],[86,2,86,5],[77,2,77,5],[75,2,75,5],[76,2,76,5],[66,2,66,5],[85,2,85,5],[69,2,69,5],[73,2,73,5],[74,2,74,5],[81,2,81,5],[84,2,84,5]]}
["Description"]
[null,"This Excel workbook is one of a suite of models that accompanies the final determination of the default price-quality path for electricity distribution 2020-2025."]
[]
["Method for creating this model"]
[null,"1","This model has been adapted from the MAR waterfall model that shows the changes from the 2015 EDB reset decision to the DPP3 Final models."]
[null,{"$f":"B5+1","v":2},"Panel D (starting at AM10) in the Inputs sheet has been populated with values from the draft decision financial model inputs sheet."]
[null,{"$f":"B6+1","v":3},"Changes have been made to the Waterfall sheet and Reconciliation sheet to include Orion, which had not been able to be included in the"]
[null,null,"waterfall model from the 2015 EDB reset decision to the Final decision models."]
[null,4,"The sheet \"DetailsOfChanges\" has been added, which displays for a chosen EDB a chart similar to the charts on the WfallCht sheet but with"]
[null,null,"the minimum and maximum values of vertical axis restricted to 85% to 110%. The chart includes data labels to show the numerical value of"]
{"$rows_left_out":81}
{"sheet":"Table of Contents","index":2,"n_rows":38,"n_cols":3,"rows_kept":38,"cut":false,"hidden":false,"merged":[]}
["Table of Contents"]
[]
[]
[null,"Sheet Name","Link"]
[null,"Waterfall","Waterfall calculations and chart for chosen EDB"]
[null,null,"EDB names and values of MAR 2019/20"]
[null,null,"Waterfall chart for chosen EDB"]
[null,"DetailsOfChanges","Details of the drivers of change from Draft decision to Final decision"]
[null,"WfallCht","Waterfall charts for 15 EDBs"]
[null,"Inputs","Inputs"]
{"$rows_left_out":29}
{"sheet":"Waterfall","index":3,"n_rows":63,"n_cols":20,"rows_kept":63,"cut":false,"hidden":false,"merged":[]}
["Waterfall calculations and chart for chosen EDB"]
[]
["EDB",null,null,"Total for selected EDBs"]
["Distributor number",null,null,{"$f":"MATCH(WfallEDB,EDBnames,0)","v":16}]
["Chosen mode",null,null,14]
[]
["EDB names and values of MAR 2019/20"]
[]
[null,1,2,3,4,5,6,7,8,9,10,11,12,13,14,15,16,17]
[null,"Alpine Energy","Aurora Energy","Centralines","EA Networks","Eastland Network","Electricity Invercargill","Horizon Energy","Nelson Electricity","Network Tasman","Orion NZ","OtagoNet","The Lines Company","Top Energy","Unison Networks","Vector Lines","Total for selected EDBs"]
{"$rows_left_out":54}
{"sheet":"DetailsOfChanges","index":4,"n_rows":73,"n_cols":13,"rows_kept":73,"cut":false,"hidden":false,"merged":[]}
["Details of the drivers of change from Draft decision to Final decision"]
[]
["To select the EDB for which the details chart below is to be displayed, selected the EDB at Cell D3 on the \"Waterfall\" sheet."]
[]
[]
[]
[]
[]
[]
[]
{"$rows_left_out":64}
{"sheet":"WfallCht","index":5,"n_rows":6,"n_cols":50,"rows_kept":6,"cut":false,"hidden":false,"merged":[]}
["Waterfall charts for 15 EDBs"]
[null,null,null,null,"For a more detailed view of the drivers of the changes from the Draft decision models to the Final decision, see the 'DetailsOfChanges' sheet."]
[]
[null,null,null,null,null,null,null,null,null,null,null,null,null,null,null,null,null,null,null,null,null,null,null,null,null,null,null,null,null,null,null,null,null,null,null,null,null,null,null,null,null,null,null,null,null,null,null,null,null,"Waterfall Charts"]
[null,null,null,null,null,null,null,null,null,null,null,null,null,null,null,null,null,null,null,null,null,null,null,null,null,null,null,null,null,null,null,null,null,null,null,null,null,null,null,null,null,null,null,null,null,null,null,null,null,"An aid to interpreting these charts is on the Description sheet, under the headings 'Waterfall Chart' and 'Input categories'."]
[null,null,null,null,null,null,null,null,null,null,null,null,null,null,null,null,null,null,null,null,null,null,null,null,null,null,null,null,null,null,null,null,null,null,null,null,null,null,null,null,null,null,null,null,null,null,null,null,null,"The chart \"Total for selected EDBs\" is for all non-exempt EDBs except those on a CPP in 2020/21, ie, except Powerco and Wellington Electricity."]

{"sheet":"Inputs","index":6,"n_rows":97,"n_cols":73,"rows_kept":97,"cut":false,"hidden":false,"merged":[]}
["Inputs"]
["A","The mode in cell C5 is chosen on the Waterfall sheet cell D5."]
[null,"All input data is entered into this worksheet"]
[null,"Waterfall chart parameters"]
[null,"Chosen mode",{"$f":"Waterfall!D5","v":14}]
[]
[]
[]
[]
["B","Values for chosen mode",null,null,null,null,null,null,null,null,null,null,null,null,null,null,null,null,null,null,"C","Values from Financial model",null,null,null,null,null,null,null,null,null,null,null,null,null,null,null,null,"D","Values for draft decision 2020 reset model"]
{"$rows_left_out":88}
{"sheet":"EDB data","index":7,"n_rows":88,"n_cols":8,"rows_kept":88,"cut":false,"hidden":false,"merged":[]}
["Inputs for the selected distributor",null,null,null,null,null,null,{"$f":"EDB_Name","v":"Total for selected EDBs"}]
["Data from the Inputs sheet that relates to the selected distributor. The distributor's name is user-selected in cell C4."]
["Distributor",null,"Scenario"]
["Name",null,{"$f":"Waterfall!D3","v":"Total for selected EDBs"}]
["Distributor number",null,{"$f":"Reconciliation!C6","v":{"$error":"#N/A"}}]
["Distributor number (for output data table)",null,{"$f":"HLOOKUP(EDB_Name,Inputs!$C$28:$S$29,2,FALSE)","v":{"$error":"#N/A"}}]
[]
["General data"]
["Non business-specific single inputs","Value"]
[{"$f":"Inputs!B22","v":"Vanilla WACC (67th percentile)"},{"$f":"Inputs!C22","v":4.5699999999999998E-2}]
{"$rows_left_out":79}
{"sheet":"TIMING","index":8,"n_rows":43,"n_cols":15,"rows_kept":43,"cut":false,"hidden":false,"merged":[]}
["Intra-year timing"]
["Derivation of the five timing factors TFopex, TFtax, TFVCA, TFori and TFrev."]
["Inputs"]
[null,"From","Value"]
["Last day of year 1 of the DPP period","EDB data",{"$f":"'EDB data'!B18","v":"2021-03-31"}]
["Days in a year","EDB data",{"$f":"'EDB data'!B15","v":365}]
["Days from mid-year to year-end","EDB data",{"$f":"'EDB data'!B16","v":182}]
["Days from revenue date to year-end","EDB data",{"$f":"'EDB data'!B17","v":148}]
["Vanilla WACC (67th percentile)","EDB data",{"$f":"WACC","v":4.5699999999999998E-2}]
["Calculations"]
{"$rows_left_out":34}
{"sheet":"RAB","index":9,"n_rows":95,"n_cols":10,"rows_kept":95,"cut":false,"hidden":false,"merged":[]}
["Regulatory asset base",null,null,null,null,null,null,null,null,{"$f":"EDB_Name","v":"Total for selected EDBs"}]
["Calculations involving the roll-forward of asset values."]
["Inputs"]
[null,"From","Value",{"$f":"Inputs!D$12","v":"2018/19"},{"$f":"Inputs!E$12","v":"2019/20"},{"$f":"Inputs!F$12","v":"2020/21"},{"$f":"Inputs!G$12","v":"2021/22"},{"$f":"Inputs!H$12","v":"2022/23"},{"$f":"Inputs!I$12","v":"2023/24"},{"$f":"Inputs!J$12","v":"2024/25"}]
["Opening RAB","EDB data",{"$f":"'EDB data'!B28","v":{"$error":"#N/A"}}]
["Total depreciation","EDB data",{"$f":"'EDB data'!B31","v":{"$error":"#N/A"}}]
["Revaluations","EDB data",{"$f":"'EDB data'!B32","v":{"$error":"#N/A"}}]
["Closing RAB","EDB data",{"$f":"'EDB data'!B33","v":{"$error":"#N/A"}}]
["Disposed assets","EDB data",null,{"$f":"'EDB data'!$B73","v":{"$error":"#N/A"}},{"$f":"'EDB data'!$B74","v":{"$error":"#N/A"}},{"$f":"'EDB data'!$B75","v":{"$error":"#N/A"}},{"$f":"'EDB data'!$B76","v":{"$error":"#N/A"}},{"$f":"'EDB data'!$B77","v":{"$error":"#N/A"}},{"$f":"'EDB data'!$B78","v":{"$error":"#N/A"}},{"$f":"'EDB data'!$B79","v":{"$error":"#N/A"}}]
["Value of commissioned assets","EDB data",null,{"$f":"'EDB data'!$B64","v":{"$error":"#N/A"}},{"$f":"'EDB data'!$B65","v":{"$error":"#N/A"}},{"$f":"'EDB data'!$B66","v":{"$error":"#N/A"}},{"$f":"'EDB data'!$B67","v":{"$error":"#N/A"}},{"$f":"'EDB data'!$B68","v":{"$error":"#N/A"}},{"$f":"'EDB data'!$B69","v":{"$error":"#N/A"}},{"$f":"'EDB data'!$B70","v":{"$error":"#N/A"}}]
{"$rows_left_out":86}
{"sheet":"TAX","index":10,"n_rows":98,"n_cols":10,"rows_kept":98,"cut":false,"hidden":false,"merged":[]}
["Tax calculations",null,null,null,null,null,null,null,null,{"$f":"EDB_Name","v":"Total for selected EDBs"}]
["Calculations involving the roll-forward of adjusted depreciation regulatory asset values, deferred tax and tax adjustments."]
["Inputs"]
[null,"Source","Value",{"$f":"Inputs!D$12","v":"2018/19"},{"$f":"Inputs!E$12","v":"2019/20"},{"$f":"Inputs!F$12","v":"2020/21"},{"$f":"Inputs!G$12","v":"2021/22"},{"$f":"Inputs!H$12","v":"2022/23"},{"$f":"Inputs!I$12","v":"2023/24"},{"$f":"Inputs!J$12","v":"2024/25"}]
["Year in modelling period","EDB data",null,{"$f":"'EDB data'!B21","v":1},{"$f":"'EDB data'!C21","v":2},{"$f":"'EDB data'!D21","v":3},{"$f":"'EDB data'!E21","v":4},{"$f":"'EDB data'!F21","v":5},{"$f":"'EDB data'!G21","v":6},{"$f":"'EDB data'!H21","v":7}]
["Tax rate","EDB data",null,{"$f":"'EDB data'!B25","v":0.28000000000000003},{"$f":"'EDB data'!C25","v":0.28000000000000003},{"$f":"'EDB data'!D25","v":0.28000000000000003},{"$f":"'EDB data'!E25","v":0.28000000000000003},{"$f":"'EDB data'!F25","v":0.28000000000000003},{"$f":"'EDB data'!G25","v":0.28000000000000003},{"$f":"'EDB data'!H25","v":0.28000000000000003}]
["Value of commissioned assets","EDB data",null,{"$f":"'EDB data'!$B64","v":{"$error":"#N/A"}},{"$f":"'EDB data'!$B65","v":{"$error":"#N/A"}},{"$f":"'EDB data'!$B66","v":{"$error":"#N/A"}},{"$f":"'EDB data'!$B67","v":{"$error":"#N/A"}},{"$f":"'EDB data'!$B68","v":{"$error":"#N/A"}},{"$f":"'EDB data'!$B69","v":{"$error":"#N/A"}},{"$f":"'EDB data'!$B70","v":{"$error":"#N/A"}}]
["Remaining life of newly commissioned assets","EDB data",null,{"$f":"'EDB data'!B13","v":44}]
["Amortisation of initial differences in asset values","EDB data",null,{"$f":"'EDB data'!B38","v":{"$error":"#N/A"}}]
["Lost assets","EDB data",null,{"$f":"'EDB data'!B29","v":{"$error":"#N/A"}}]
{"$rows_left_out":89}
{"sheet":"BBAR","index":11,"n_rows":59,"n_cols":10,"rows_kept":59,"cut":false,"hidden":false,"merged":[]}
["Building blocks allowable revenue",null,null,null,null,null,null,null,null,{"$f":"EDB_Name","v":"Total for selected EDBs"}]
["Derivation of BBAR present value, opening investment value, and TCSD allowance."]
["Inputs"]
[null,"Source","Value",{"$f":"Inputs!D$12","v":"2018/19"},{"$f":"Inputs!E$12","v":"2019/20"},{"$f":"Inputs!F$12","v":"2020/21"},{"$f":"Inputs!G$12","v":"2021/22"},{"$f":"Inputs!H$12","v":"2022/23"},{"$f":"Inputs!I$12","v":"2023/24"},{"$f":"Inputs!J$12","v":"2024/25"}]
["Year in regulatory period","EDB data",null,null,null,{"$f":"'EDB data'!D22","v":1},{"$f":"'EDB data'!E22","v":2},{"$f":"'EDB data'!F22","v":3},{"$f":"'EDB data'!G22","v":4},{"$f":"'EDB data'!H22","v":5}]
["Tax rate","EDB data",null,{"$f":"'EDB data'!B25","v":0.28000000000000003},{"$f":"'EDB data'!C25","v":0.28000000000000003},{"$f":"'EDB data'!D25","v":0.28000000000000003},{"$f":"'EDB data'!E25","v":0.28000000000000003},{"$f":"'EDB data'!F25","v":0.28000000000000003},{"$f":"'EDB data'!G25","v":0.28000000000000003},{"$f":"'EDB data'!H25","v":0.28000000000000003}]
["Other regulated income","EDB data",null,{"$f":"'EDB data'!$B82","v":{"$error":"#N/A"}},{"$f":"'EDB data'!$B83","v":{"$error":"#N/A"}},{"$f":"'EDB data'!$B84","v":{"$error":"#N/A"}},{"$f":"'EDB data'!$B85","v":{"$error":"#N/A"}},{"$f":"'EDB data'!$B86","v":{"$error":"#N/A"}},{"$f":"'EDB data'!$B87","v":{"$error":"#N/A"}},{"$f":"'EDB data'!$B88","v":{"$error":"#N/A"}}]
["Term credit spread differential allowance","EDB data",null,{"$f":"'EDB data'!B39","v":{"$error":"#N/A"}}]
["Value of commissioned assets","EDB data",null,{"$f":"'EDB data'!$B64","v":{"$error":"#N/A"}},{"$f":"'EDB data'!$B65","v":{"$error":"#N/A"}},{"$f":"'EDB data'!$B66","v":{"$error":"#N/A"}},{"$f":"'EDB data'!$B67","v":{"$error":"#N/A"}},{"$f":"'EDB data'!$B68","v":{"$error":"#N/A"}},{"$f":"'EDB data'!$B69","v":{"$error":"#N/A"}},{"$f":"'EDB data'!$B70","v":{"$error":"#N/A"}}]
["Operating expenditure","EDB data",null,{"$f":"'EDB data'!$B46","v":{"$error":"#N/A"}},{"$f":"'EDB data'!$B47","v":{"$error":"#N/A"}},{"$f":"'EDB data'!$B48","v":{"$error":"#N/A"}},{"$f":"'EDB data'!$B49","v":{"$error":"#N/A"}},{"$f":"'EDB data'!$B50","v":{"$error":"#N/A"}},{"$f":"'EDB data'!$B51","v":{"$error":"#N/A"}},{"$f":"'EDB data'!$B52","v":{"$error":"#N/A"}}]
{"$rows_left_out":50}
{"sheet":"REV","index":12,"n_rows":28,"n_cols":8,"rows_kept":28,"cut":false,"hidden":false,"merged":[]}
["Revenue growth index",null,null,null,null,null,null,{"$f":"EDB_Name","v":"Total for selected EDBs"}]
["Derivation of the normalised profile of the maximum allowable revenue before tax values."]
["Inputs"]
[null,"Source","Value",{"$f":"Inputs!F$12","v":"2020/21"},{"$f":"Inputs!G$12","v":"2021/22"},{"$f":"Inputs!H$12","v":"2022/23"},{"$f":"Inputs!I$12","v":"2023/24"},{"$f":"Inputs!J$12","v":"2024/25"}]
["Constant price revenue growth","EDB data",null,{"$f":"'EDB data'!$B57","v":{"$error":"#N/A"}},{"$f":"'EDB data'!$B58","v":{"$error":"#N/A"}},{"$f":"'EDB data'!$B59","v":{"$error":"#N/A"}},{"$f":"'EDB data'!$B60","v":{"$error":"#N/A"}},{"$f":"'EDB data'!$B61","v":{"$error":"#N/A"}}]
["Industry-wide X factor","EDB data",{"$f":"'EDB data'!B14","v":0}]
["Alternative X factor","EDB data",{"$f":"'EDB data'!B43","v":""}]
["Forecast changes in the CPI element of the price path","EDB data",null,{"$f":"'EDB data'!D24","v":1.7504378984726898E-2},{"$f":"'EDB data'!E24","v":1.9502114592602871E-2},{"$f":"'EDB data'!F24","v":2.0248058977042183E-2},{"$f":"'EDB data'!G24","v":2.0000000000000018E-2},{"$f":"'EDB data'!H24","v":2.0000000000000018E-2}]
["Calculations"]
[{"$f":"\"Index of price path with industry-wide X factor of \"&TEXT(C6,\"#0.0%\")","v":"Index of price path with industry-wide X factor of 0.0%"}]
{"$rows_left_out":19}
{"sheet":"MAR","index":13,"n_rows":61,"n_cols":8,"rows_kept":61,"cut":false,"hidden":false,"merged":[]}
["Maximum allowable revenue",null,null,null,null,null,null,{"$f":"EDB_Name","v":"Total for selected EDBs"}]
["Derivation of starting prices."]
["Inputs"]
[null,"Source","Value",{"$f":"Inputs!F$12","v":"2020/21"},{"$f":"Inputs!G$12","v":"2021/22"},{"$f":"Inputs!H$12","v":"2022/23"},{"$f":"Inputs!I$12","v":"2023/24"},{"$f":"Inputs!J$12","v":"2024/25"}]
["Year in regulatory period","EDB data",null,{"$f":"'EDB data'!D22","v":1},{"$f":"'EDB data'!E22","v":2},{"$f":"'EDB data'!F22","v":3},{"$f":"'EDB data'!G22","v":4},{"$f":"'EDB data'!H22","v":5}]
["Industry-wide X factor","EDB data",{"$f":"'EDB data'!B14","v":0}]
["Additional allowance in 1 April 2015 PV terms","EDB data",{"$f":"'EDB data'!B42","v":{"$error":"#N/A"}}]
["Alternative X factor","EDB data",{"$f":"'EDB data'!B43","v":""}]
["Vanilla WACC (67th percentile)","EDB data",{"$f":"WACC","v":4.5699999999999998E-2}]
["TFrev","TIMING",{"$f":"TIMING!C27","v":1.0182846181695255}]
{"$rows_left_out":52}
{"sheet":"Reconciliation","index":14,"n_rows":64,"n_cols":56,"rows_kept":64,"cut":false,"hidden":false,"merged":[[40,31,63,31],[7,22,7,31],[38,21,38,33],[4,2,4,3],[3,2,3,3],[5,2,5,3],[6,2,6,3],[38,2,38,15],[40,11,63,11]]}
["Reconciliation with financial models outputs"]
["Reconciliation of this waterfall model outputs with 2015 and 2020 financial model outputs",null,null,null,null,"How this sheet operates",null,null,null,null,"Mode is set by Cell C5 on the Waterfall chart.",null,null,null,null,{"$f":"\"Currently, mode = \" & Waterfall!D5","v":"Currently, mode = 14"}]
[null,null,null,null,null,"When the mode is set to 14, the panel with a blue fill colour below (see Cell W11) should be filled with zeros."]
["Distributor",null,"Scenario",null,null,"When the mode is set to 0, the panel with a tan fill colour below (see Cell C40) should be filled with zeros."]
["Name",null,{"$f":"EDB_Name","v":"Total for selected EDBs"}]
["Distributor number",null,{"$f":"'EDB data'!C6","v":{"$error":"#N/A"}},null,null,null,"Block below with this fill colour is for data table with first argument set to C5, second argument blank."]
[]
[null,"Active EDB outputs",{"$f":"Inputs!C28","v":"Alpine Energy"},{"$f":"Inputs!D28","v":"Aurora Energy"},{"$f":"Inputs!E28","v":"Centralines"},{"$f":"Inputs!F28","v":"EA Networks"},{"$f":"Inputs!G28","v":"Eastland Network"},{"$f":"Inputs!H28","v":"Electricity Invercargill"},{"$f":"Inputs!I28","v":"Horizon Energy"},{"$f":"Inputs!J28","v":"Nelson Electricity"},{"$f":"Inputs!K28","v":"Network Tasman"},{"$f":"Inputs!L28","v":"Orion NZ"},{"$f":"Inputs!M28","v":"OtagoNet"},{"$f":"Inputs!N28","v":"Powerco"},{"$f":"Inputs!O28","v":"The Lines Company"},{"$f":"Inputs!P28","v":"Top Energy"},{"$f":"Inputs!Q28","v":"Unison Networks"},{"$f":"Inputs!R28","v":"Vector Lines"},{"$f":"Inputs!S28","v":"Wellington Electricity"},null,null,null,"Reconciliation of this waterfall model with the 2020 financial model outputs is achieved when the blue coloured panel below indicates zero values. This requires the \"mode\" setting at cell D5 on the Waterfall sheet to be set to 14. Powerco is not represented in this panel as it is not featured in the outputs of the DPP3 financial model."]
["Distributor number",{"$f":"C6","v":{"$error":"#N/A"}},{"$f":"Inputs!C29","v":1},{"$f":"Inputs!D29","v":2},{"$f":"Inputs!E29","v":3},{"$f":"Inputs!F29","v":4},{"$f":"Inputs!G29","v":5},{"$f":"Inputs!H29","v":6},{"$f":"Inputs!I29","v":7},{"$f":"Inputs!J29","v":8},{"$f":"Inputs!K29","v":9},{"$f":"Inputs!L29","v":10},{"$f":"Inputs!M29","v":11},{"$f":"Inputs!N29","v":12},{"$f":"Inputs!O29","v":13},{"$f":"Inputs!P29","v":14},{"$f":"Inputs!Q29","v":15},{"$f":"Inputs!R29","v":16},{"$f":"Inputs!S29","v":17}]
["Outputs",null,0,0,0,0,0,0,0,0,0,0,0,0,0,0,0,0,0,null,null,null,"Alpine Energy","Aurora Energy","Centralines","EA Networks","Eastland Network","Electricity Invercargill","Horizon Energy","Nelson Electricity","Network Tasman","Orion","OtagoNet","The Lines Company","Top Energy","Unison Networks","Vector Lines","Wellington Electricity",null,null,"Alpine Energy","Aurora Energy","Centralines","EA Networks","Eastland Network","Electricity Invercargill","Horizon Energy","Nelson Electricity","Network Tasman","Orion","OtagoNet","The Lines Company","Top Energy","Unison Networks","Vector Lines","Wellington Electricity"]
{"$rows_left_out":54}