{"text_format":"1","workbook":"xlsx","n_sheets":13,"sheets":["CoverSheet","Description","Table of Contents","Waterfall","WfallCht","Inputs","EDB data","TIMING","RAB","TAX","BBAR","REV","MAR"],"not_rendered":{"charts":1,"images":16,"macros":1,"external_links":0,"defined_names":30,"comments":1,"pivot_tables":0},"unopened":[],"bounds":{"document_bytes":16777216,"sheet_cells":100000,"rows_first":2000,"rows_last":500,"rows_between":2000,"halvings":0,"cell_chars":16384,"cell_head_chars":4096},"cells_cut":0,"cells_raw":0,"read":"whole","date_system":"1900"}

{"sheet":"CoverSheet","index":0,"n_rows":17,"n_cols":1,"rows_kept":17,"cut":false,"hidden":false,"merged":[]}
[]
[]
["Electricity Distribution Business"]
["Price-Quality Regulation 1 April 2025 DPP Reset"]
["MAR waterfall model (MAR 2021 to MAR 2026)"]
["Draft DPP4 determination"]
[]
[]
[]
[]
[]
[]
[]
[]
[]
{"$rows_left_out":3}
{"sheet":"Description","index":1,"n_rows":64,"n_cols":3,"rows_kept":64,"cut":false,"hidden":false,"merged":[[50,2,50,3],[49,2,49,3],[44,2,44,3],[45,2,45,3],[48,2,48,3],[47,2,47,3],[46,2,46,3]]}
["Description"]
["General description"]
[null,1,"This waterfall model produces a waterfall chart for each of non-exempt EDB (some EDBs exluded - see below) to show a breakdown of the  drivers of the change in the building blocks allowable revenue (BBAR) from the DPP3 reset to the BBAR for the DPP4 reset. A waterfall chart for each of the included EDBs is on the 'WaterfallCht' sheet. There is also a chart for the totals for the EDBs. There are waterfall charts for only 14 of the 16 non-exempt EDBs. This is because the charts show the difference between the DPP3 financial model and the DPP4 financial model, so an EDB must feature in both of these models to be fully included in this model. Orion, Wellington Electricity and Powerco do not feature in the charts in WfallCht as they have been on CPPs. However the calculations for Wellington have been included even though Wellington was on a CPP in the first year of DPP3. Wellington was included in the DPP3 financial model and this provided the data necessary. Select Wellington Electricity as the chosen EDB at D3 on the Waterfall sheet to view the Wellington MAR waterfall chart.\n\nThe EDB on which the model is to focus can be selected at Cell D# on the Waterfall sheet."]
[]
["Overview of model structure"]
[null,1,"This model incorporates a copy of much of the 2024 EDB DPP reset financial model. The sheets from 'Inputs' to 'MAR' are the copied sheets."]
[null,2,"The modifications extend the capability of the 2024 model to take into account the IM changes for the depreciation of existing assets. With this modification, the copied sheets can perform the calculations for the DPP4 reset."]
[null,3,"The model inputs include both the set of inputs used for the DPP3 reset and the set used for the DPP4 reset. When all the DPP3 inputs are used, then the results reconcile with the DPP3 financial model. When the DPP4 inputs are used, the results reconcile with the DPP4 financial model."]
[null,4,"For each EDB, the model recalculates the MAR values for 7 different sets of input data, each of these 7 sets being a combination of input data from the DPP3 reset for some inputs and input data from the draft DPP4 reset for the rest of the data. Arranging the sequence of these data combinations allows for the impact of various impacts to be determined for the waterfall charts."]
[null,5,"We discuss the 7 sets of input data combinations below in the context of the waterfall chart for the total for selected EDBs."]
[]
["Waterfall chart"]
[null,null,"The chart below is an example of the waterfall charts that this model prepares for non-exempt EDBs.\nA set of 14 charts is available on the sheet 'WfallCht'."]
[]
[]
{"$rows_left_out":50}
{"sheet":"Table of Contents","index":2,"n_rows":37,"n_cols":3,"rows_kept":37,"cut":false,"hidden":false,"merged":[]}
["Table of Contents"]
[]
[]
[null,"Sheet Name","Link"]
[null,"Waterfall","Waterfall calculations and chart for chosen EDB"]
[null,null,"EDB names and values of MAR 2019/20"]
[null,null,"Waterfall chart for chosen EDB"]
[null,"WfallCht","Waterfall charts for 14 EDBs"]
[null,"Inputs","Inputs"]
[null,"EDB data","Inputs for the selected distributor"]
[null,"TIMING","Intra-year timing"]
[null,null,"Inputs"]
[null,null,"Calculations"]
[null,null,"Outputs"]
[null,null,"Check for timing of revenue receipt"]
{"$rows_left_out":23}
{"sheet":"Waterfall","index":3,"n_rows":49,"n_cols":20,"rows_kept":49,"cut":false,"hidden":false,"merged":[[39,0,39,1]]}
["Waterfall calculations and chart for chosen EDB"]
[]
["EDB",null,null,"Vector Lines"]
["Distributor number",null,null,{"$f":"MATCH(WfallEDB,EDBnames,0)","v":14}]
["Chosen mode",null,null,9]
[]
["EDB names and values of MAR 2024/25"]
[]
[null,1,2,3,4,5,6,7,8,9,10,11,12,13,14,15,16]
[null,"Alpine Energy","Aurora Energy","EA Networks","Firstlight Network","Electricity Invercargill","Horizon Energy","Nelson Electricity","Network Tasman","Orion","OtagoNet","The Lines Company","Top Energy","Unison Networks","Vector Lines","Wellington Electricity","Total for selected EDBs"]
["2024/25 net allowable revenue",{"$f":"Inputs!C97","v":46157.226101945445},{"$f":"Inputs!D97","v":94510.551704352954},{"$f":"Inputs!E97","v":35991.478436364734},{"$f":"Inputs!F97","v":26002.778535077268},{"$f":"Inputs!G97","v":13264.672234010673},{"$f":"Inputs!H97","v":25876.909418753163},{"$f":"Inputs!I97","v":5953.8304682776161},{"$f":"Inputs!J97","v":28625.977368285854},{"$f":"Inputs!K97","v":171520.79203375385},{"$f":"Inputs!L97","v":27897.551291870823},{"$f":"Inputs!M97","v":37559.707544133955},{"$f":"Inputs!N97","v":41138.068282168002},{"$f":"Inputs!O97","v":108237.57631261626},{"$f":"Inputs!P97","v":420645.93702793325},{"$f":"Inputs!Q97","v":98917.684287082389},{"$f":"SUM(B11,D11:O11)","v":988872.505055191}]
[]
["Waterfall chart for chosen EDB"]
[]
[]
{"$rows_left_out":35}
{"sheet":"WfallCht","index":4,"n_rows":5,"n_cols":50,"rows_kept":5,"cut":false,"hidden":false,"merged":[]}
["Waterfall charts for 14 EDBs"]
[]
[null,null,null,null,null,null,null,null,null,null,null,null,null,null,null,null,null,null,null,null,null,null,null,null,null,null,null,null,null,null,null,null,null,null,null,null,null,null,null,null,null,null,null,null,null,null,null,null,null,"Waterfall Charts"]
[null,null,null,null,null,null,null,null,null,null,null,null,null,null,null,null,null,null,null,null,null,null,null,null,null,null,null,null,null,null,null,null,null,null,null,null,null,null,null,null,null,null,null,null,null,null,null,null,null,"An aid to interpreting these charts is on the Description sheet, under the headings 'Waterfall Chart' and 'Input categories'."]
[null,null,null,null,null,null,null,null,null,null,null,null,null,null,null,null,null,null,null,null,null,null,null,null,null,null,null,null,null,null,null,null,null,null,null,null,null,null,null,null,null,null,null,null,null,null,null,null,null,"The chart \"Total for selected EDBs\" is for all non-exempt EDBs except those on a CPP at the start of DPP3 or the start of DPP4, ie, except Aurora, Powerco and Wellington Electricity."]

{"sheet":"Inputs","index":5,"n_rows":106,"n_cols":54,"rows_kept":106,"cut":false,"hidden":false,"merged":[]}
["Inputs"]
["A","Choice of which EDB to consider and the chosen 'mode'.",null,null,null,null,null,null,null,null,null,null,null,null,null,null,null,null,null,null,null,null,{"$f":"U21","v":"2024-03-31"}]
[null,"All input data is entered into this worksheet"]
[null,"Waterfall chart parameters"]
[null,"Chosen mode",{"$f":"Waterfall!D5","v":9}]
[null,"EDB selected (cell D3 of 'Waterfall' sheet).",{"$f":"EDB_Name","v":"Vector Lines"}]
[]
[]
[]
["B","Values for chosen mode",null,null,null,null,null,null,null,null,null,null,null,null,null,null,null,null,null,null,"C","Values from DPP4 Financial model",null,null,null,null,null,null,null,null,null,null,null,null,null,null,null,null,"D","Values from DPP3 financial model"]
["Mode","Inputs that are the same for all distributors"]
[2,"Reset timeline","Value",{"$f":"IF($C$5<$A12,AN12,V12)","v":"2023/24"},"2024/25","2025/26","2026/27","2027/28","2028/29","2029/30",null,null,null,null,null,null,null,null,null,null,null,"2023/24",{"$f":"LEFT(V12,4)+1 & \"/\" & RIGHT(V12,2)+1","v":"2024/25"},{"$f":"LEFT(W12,4)+1 & \"/\" & RIGHT(W12,2)+1","v":"2025/26"},{"$f":"LEFT(X12,4)+1 & \"/\" & RIGHT(X12,2)+1","v":"2026/27"},{"$f":"LEFT(Y12,4)+1 & \"/\" & RIGHT(Y12,2)+1","v":"2027/28"},{"$f":"LEFT(Z12,4)+1 & \"/\" & RIGHT(Z12,2)+1","v":"2028/29"},{"$f":"LEFT(AA12,4)+1 & \"/\" & RIGHT(AA12,2)+1","v":"2029/30"},null,null,null,null,null,null,null,null,null,null,null,"2018/19",{"$f":"LEFT(AN12,4)+1 & \"/\" & RIGHT(AN12,2)+1","v":"2019/20"},{"$f":"LEFT(AO12,4)+1 & \"/\" & RIGHT(AO12,2)+1","v":"2020/21"},"2021/22","2022/23","2023/24","2024/25"]
[1,"Year in modelling period",null,1,2,3,4,5,6,7,null,null,null,null,null,null,null,null,null,null,null,1,2,3,4,5,6,7,null,null,null,null,null,null,null,null,null,null,null,1,2,3,4,5,6,7]
[1,"Year in regulatory period",null,null,null,1,2,3,4,5,null,null,null,null,null,null,null,null,null,null,null,null,null,1,2,3,4,5,null,null,null,null,null,null,null,null,null,null,null,null,null,1,2,3,4,5]
[3,"Forecast changes in CPI used for revaluations",null,{"$f":"IF($C$5<$A15,AN15,V15)","v":4.022988505747116E-2},2.6000000000000023E-2,2.0000000000000018E-2,2.0000000000000018E-2,2.0000000000000018E-2,2.0000000000000018E-2,2.0000000000000018E-2,null,null,null,null,null,null,null,null,null,null,null,4.022988505747116E-2,2.6000000000000023E-2,2.0000000000000018E-2,2.0000000000000018E-2,2.0000000000000018E-2,2.0000000000000018E-2,2.0000000000000018E-2,null,null,null,null,null,null,null,null,null,null,null,1.4836795252225476E-2,1.6999999999999904E-2,1.8999999999999906E-2,2.0000000000000018E-2,2.0000000000000018E-2,2.0000000000000018E-2,2.0000000000000018E-2]
{"$rows_left_out":92}
{"sheet":"EDB data","index":6,"n_rows":96,"n_cols":8,"rows_kept":96,"cut":false,"hidden":false,"merged":[]}
["Inputs for the selected distributor",null,null,null,null,null,null,{"$f":"EDB_Name","v":"Vector Lines"}]
["Data from the Inputs sheet that relates to the selected distributor. The distributor's name is user-selected in cell C4."]
["Distributor",null,"Scenario"]
["Name",null,{"$f":"Waterfall!D3","v":"Vector Lines"}]
["Distributor number",null,{"$f":"SuppNum","v":14}]
["Distributor number (for output data table)",null,{"$f":"HLOOKUP(EDB_Name,Inputs!$C$28:$Q$29,2,FALSE)","v":14}]
[]
["General data"]
["Non business-specific single inputs","Value"]
[{"$f":"Inputs!B22","v":"Vanilla WACC (67th percentile)"},{"$f":"Inputs!C22","v":7.3700000000000002E-2}]
[{"$f":"Inputs!B23","v":"Cost of debt"},{"$f":"Inputs!C23","v":6.1199999999999997E-2}]
[{"$f":"Inputs!B24","v":"Leverage"},{"$f":"Inputs!C24","v":0.41}]
[{"$f":"Inputs!B25","v":"Years of remaining life for newly commissioned assets"},{"$f":"Inputs!C25","v":44},"years"]
[{"$f":"Inputs!B26","v":"Industry-wide X factor"},{"$f":"Inputs!C26","v":0}]
[{"$f":"Inputs!B18","v":"Days in a year"},{"$f":"Inputs!C18","v":365},"days"]
{"$rows_left_out":82}
{"sheet":"TIMING","index":7,"n_rows":43,"n_cols":15,"rows_kept":43,"cut":false,"hidden":false,"merged":[]}
["Intra-year timing"]
["Derivation of the five timing factors TFopex, TFtax, TFVCA, TFori and TFrev."]
["Inputs"]
[null,"From","Value"]
["Last day of year 1 of the DPP period","EDB data",{"$f":"'EDB data'!B18","v":"2024-03-31"}]
["Days in a year","EDB data",{"$f":"'EDB data'!B15","v":365}]
["Days from mid-year to year-end","EDB data",{"$f":"'EDB data'!B16","v":182}]
["Days from revenue date to year-end","EDB data",{"$f":"'EDB data'!B17","v":148}]
["Vanilla WACC (67th percentile)","EDB data",{"$f":"WACC","v":7.3700000000000002E-2}]
["Calculations"]
[null,null,"Value"]
["Mid-year date",null,{"$f":"EOMONTH(C5,-6)","v":"2023-09-30"}]
["Revenue date",null,{"$f":"C5-C8","v":"2023-11-04"},"As demonstrated below, 12 equal monthly transactions on the 20th of the following month can be approximated by a single payment on the revenue date."]
["Operating expenditure date",null,{"$f":"C12","v":"2023-09-30"},"i.e. mid-year"]
["Tax date",null,{"$f":"C12","v":"2023-09-30"},"i.e. mid-year"]
{"$rows_left_out":29}
{"sheet":"RAB","index":8,"n_rows":95,"n_cols":10,"rows_kept":95,"cut":false,"hidden":false,"merged":[]}
["Regulatory asset base",null,null,null,null,null,null,null,null,{"$f":"EDB_Name","v":"Vector Lines"}]
["Calculations involving the roll-forward of asset values."]
["Inputs"]
[null,"From","Value",{"$f":"Inputs!D$12","v":"2023/24"},{"$f":"Inputs!E$12","v":"2024/25"},{"$f":"Inputs!F$12","v":"2025/26"},{"$f":"Inputs!G$12","v":"2026/27"},{"$f":"Inputs!H$12","v":"2027/28"},{"$f":"Inputs!I$12","v":"2028/29"},{"$f":"Inputs!J$12","v":"2029/30"}]
["Opening RAB","EDB data",{"$f":"'EDB data'!B28","v":3891833.0595731898}]
["Total depreciation","EDB data",{"$f":"'EDB data'!B31","v":162364.39731151584}]
["Revaluations","EDB data",{"$f":"'EDB data'!B32","v":0}]
["Closing RAB","EDB data",{"$f":"'EDB data'!B33","v":4227215.5852645263}]
["Disposed assets","EDB data",null,{"$f":"'EDB data'!$B73","v":16163.259575132521},{"$f":"'EDB data'!$B74","v":16583.504324085967},{"$f":"'EDB data'!$B75","v":16915.174410567688},{"$f":"'EDB data'!$B76","v":17253.477898779041},{"$f":"'EDB data'!$B77","v":17598.547456754626},{"$f":"'EDB data'!$B78","v":17950.518405889718},{"$f":"'EDB data'!$B79","v":18309.528774007511}]
["Value of commissioned assets","EDB data",null,{"$f":"'EDB data'!$B64","v":358149},{"$f":"'EDB data'!$B65","v":264611.33276500728},{"$f":"'EDB data'!$B66","v":351381.70521212689},{"$f":"'EDB data'!$B67","v":343015.27558390074},{"$f":"'EDB data'!$B68","v":299481.88333566528},{"$f":"'EDB data'!$B69","v":259508.25215865433},{"$f":"'EDB data'!$B70","v":267669.71968974709}]
["Remaining life of newly commissioned assets","EDB data",{"$f":"'EDB data'!B13","v":44}]
["Forecast changes in CPI used for revaluations","EDB data",null,{"$f":"'EDB data'!B23","v":4.022988505747116E-2},{"$f":"'EDB data'!C23","v":2.6000000000000023E-2},{"$f":"'EDB data'!D23","v":2.0000000000000018E-2},{"$f":"'EDB data'!E23","v":2.0000000000000018E-2},{"$f":"'EDB data'!F23","v":2.0000000000000018E-2},{"$f":"'EDB data'!G23","v":2.0000000000000018E-2},{"$f":"'EDB data'!H23","v":2.0000000000000018E-2}]
["Adjustment factor (for accelerated depreciation)","EDB data",{"$f":"'EDB data'!B41","v":1}]
["Existing asset depreciation",null,null,null,{"$f":"TRANSPOSE('EDB data'!B91:B96)","v":162454.51512828851},158104.2403432322,153469.68465810313,152033.49170206577,151948.21663066876,150553.0898478397]
["Calculations"]
{"$rows_left_out":81}
{"sheet":"TAX","index":9,"n_rows":98,"n_cols":10,"rows_kept":98,"cut":false,"hidden":false,"merged":[]}
["Tax calculations",null,null,null,null,null,null,null,null,{"$f":"EDB_Name","v":"Vector Lines"}]
["Calculations involving the roll-forward of adjusted depreciation regulatory asset values, deferred tax and tax adjustments."]
["Inputs"]
[null,"Source","Value",{"$f":"Inputs!D$12","v":"2023/24"},{"$f":"Inputs!E$12","v":"2024/25"},{"$f":"Inputs!F$12","v":"2025/26"},{"$f":"Inputs!G$12","v":"2026/27"},{"$f":"Inputs!H$12","v":"2027/28"},{"$f":"Inputs!I$12","v":"2028/29"},{"$f":"Inputs!J$12","v":"2029/30"}]
["Year in modelling period","EDB data",null,{"$f":"'EDB data'!B21","v":1},{"$f":"'EDB data'!C21","v":2},{"$f":"'EDB data'!D21","v":3},{"$f":"'EDB data'!E21","v":4},{"$f":"'EDB data'!F21","v":5},{"$f":"'EDB data'!G21","v":6},{"$f":"'EDB data'!H21","v":7}]
["Tax rate","EDB data",null,{"$f":"'EDB data'!B25","v":0.28000000000000003},{"$f":"'EDB data'!C25","v":0.28000000000000003},{"$f":"'EDB data'!D25","v":0.28000000000000003},{"$f":"'EDB data'!E25","v":0.28000000000000003},{"$f":"'EDB data'!F25","v":0.28000000000000003},{"$f":"'EDB data'!G25","v":0.28000000000000003},{"$f":"'EDB data'!H25","v":0.28000000000000003}]
["Value of commissioned assets","EDB data",null,{"$f":"'EDB data'!$B64","v":358149},{"$f":"'EDB data'!$B65","v":264611.33276500728},{"$f":"'EDB data'!$B66","v":351381.70521212689},{"$f":"'EDB data'!$B67","v":343015.27558390074},{"$f":"'EDB data'!$B68","v":299481.88333566528},{"$f":"'EDB data'!$B69","v":259508.25215865433},{"$f":"'EDB data'!$B70","v":267669.71968974709}]
["Remaining life of newly commissioned assets","EDB data",null,{"$f":"'EDB data'!B13","v":44}]
["Amortisation of initial differences in asset values","EDB data",null,{"$f":"'EDB data'!B38","v":31571.185185185201}]
["Lost assets","EDB data",null,{"$f":"'EDB data'!B29","v":0}]
["Found assets","EDB data",null,{"$f":"'EDB data'!B30","v":0}]
["Disposed assets","EDB data",null,{"$f":"'EDB data'!$B73","v":16163.259575132521},{"$f":"'EDB data'!$B74","v":16583.504324085967},{"$f":"'EDB data'!$B75","v":16915.174410567688},{"$f":"'EDB data'!$B76","v":17253.477898779041},{"$f":"'EDB data'!$B77","v":17598.547456754626},{"$f":"'EDB data'!$B78","v":17950.518405889718},{"$f":"'EDB data'!$B79","v":18309.528774007511}]
["Opening RAB excluding revaluations","EDB data",null,{"$f":"'EDB data'!B34","v":2910221.5489542075}]
["Adjusted depreciation","EDB data",null,{"$f":"'EDB data'!B35","v":121412.29097086606}]
["Tax depreciation","EDB data",null,{"$f":"'EDB data'!B36","v":131068.38647474816}]
{"$rows_left_out":84}
{"sheet":"BBAR","index":10,"n_rows":59,"n_cols":10,"rows_kept":59,"cut":false,"hidden":false,"merged":[]}
["Building blocks allowable revenue",null,null,null,null,null,null,null,null,{"$f":"EDB_Name","v":"Vector Lines"}]
["Derivation of BBAR present value, opening investment value, and TCSD allowance."]
["Inputs"]
[null,"Source","Value",{"$f":"Inputs!D$12","v":"2023/24"},{"$f":"Inputs!E$12","v":"2024/25"},{"$f":"Inputs!F$12","v":"2025/26"},{"$f":"Inputs!G$12","v":"2026/27"},{"$f":"Inputs!H$12","v":"2027/28"},{"$f":"Inputs!I$12","v":"2028/29"},{"$f":"Inputs!J$12","v":"2029/30"}]
["Year in regulatory period","EDB data",null,null,null,{"$f":"'EDB data'!D22","v":1},{"$f":"'EDB data'!E22","v":2},{"$f":"'EDB data'!F22","v":3},{"$f":"'EDB data'!G22","v":4},{"$f":"'EDB data'!H22","v":5}]
["Tax rate","EDB data",null,{"$f":"'EDB data'!B25","v":0.28000000000000003},{"$f":"'EDB data'!C25","v":0.28000000000000003},{"$f":"'EDB data'!D25","v":0.28000000000000003},{"$f":"'EDB data'!E25","v":0.28000000000000003},{"$f":"'EDB data'!F25","v":0.28000000000000003},{"$f":"'EDB data'!G25","v":0.28000000000000003},{"$f":"'EDB data'!H25","v":0.28000000000000003}]
["Other regulated income","EDB data",null,{"$f":"'EDB data'!$B82","v":0},{"$f":"'EDB data'!$B83","v":0},{"$f":"'EDB data'!$B84","v":0},{"$f":"'EDB data'!$B85","v":0},{"$f":"'EDB data'!$B86","v":0},{"$f":"'EDB data'!$B87","v":0},{"$f":"'EDB data'!$B88","v":0}]
["Term credit spread differential allowance","EDB data",null,{"$f":"'EDB data'!B39","v":3388.5386192854958}]
["Value of commissioned assets","EDB data",null,{"$f":"'EDB data'!$B64","v":358149},{"$f":"'EDB data'!$B65","v":264611.33276500728},{"$f":"'EDB data'!$B66","v":351381.70521212689},{"$f":"'EDB data'!$B67","v":343015.27558390074},{"$f":"'EDB data'!$B68","v":299481.88333566528},{"$f":"'EDB data'!$B69","v":259508.25215865433},{"$f":"'EDB data'!$B70","v":267669.71968974709}]
["Operating expenditure","EDB data",null,{"$f":"'EDB data'!$B46","v":0},{"$f":"'EDB data'!$B47","v":0},{"$f":"'EDB data'!$B48","v":188309.08450193581},{"$f":"'EDB data'!$B49","v":195504.42394472024},{"$f":"'EDB data'!$B50","v":202992.17915631115},{"$f":"'EDB data'!$B51","v":211094.39023679559},{"$f":"'EDB data'!$B52","v":219593.78555825644}]
["Vanilla WACC (67th percentile)","EDB data",{"$f":"WACC","v":7.3700000000000002E-2}]
["TFopex","TIMING",{"$f":"TIMING!C23","v":1.0360940296307961}]
["TFtax","TIMING",{"$f":"TIMING!C24","v":1.0360940296307961}]
["TFVCA","TIMING",{"$f":"TIMING!C25","v":1.0360940296307961}]
["TFori","TIMING",{"$f":"TIMING!C26","v":1.0360940296307961}]
{"$rows_left_out":45}
{"sheet":"REV","index":11,"n_rows":28,"n_cols":8,"rows_kept":28,"cut":false,"hidden":false,"merged":[]}
["Revenue growth index",null,null,null,null,null,null,{"$f":"EDB_Name","v":"Vector Lines"}]
["Derivation of the normalised profile of the maximum allowable revenue before tax values."]
["Inputs"]
[null,"Source","Value",{"$f":"Inputs!F$12","v":"2025/26"},{"$f":"Inputs!G$12","v":"2026/27"},{"$f":"Inputs!H$12","v":"2027/28"},{"$f":"Inputs!I$12","v":"2028/29"},{"$f":"Inputs!J$12","v":"2029/30"}]
["Constant price revenue growth","EDB data",null,{"$f":"'EDB data'!$B57","v":0},{"$f":"'EDB data'!$B58","v":0},{"$f":"'EDB data'!$B59","v":0},{"$f":"'EDB data'!$B60","v":0},{"$f":"'EDB data'!$B61","v":0}]
["Industry-wide X factor","EDB data",{"$f":"'EDB data'!B14","v":0}]
["Alternative X factor","EDB data",{"$f":"'EDB data'!B43","v":-8.5000000000000006E-2}]
["Forecast changes in the CPI element of the price path","EDB data",null,{"$f":"'EDB data'!D24","v":2.123720699589815E-2},{"$f":"'EDB data'!E24","v":2.0000000000000018E-2},{"$f":"'EDB data'!F24","v":2.0000000000000018E-2},{"$f":"'EDB data'!G24","v":2.0000000000000018E-2},{"$f":"'EDB data'!H24","v":2.0000000000000018E-2}]
["Calculations"]
[{"$f":"\"Index of price path with industry-wide X factor of \"&TEXT(C6,\"#0.0%\")","v":"Index of price path with industry-wide X factor of 0.0%"}]
[null,null,"Value",{"$f":"Inputs!F$12","v":"2025/26"},{"$f":"Inputs!G$12","v":"2026/27"},{"$f":"Inputs!H$12","v":"2027/28"},{"$f":"Inputs!I$12","v":"2028/29"},{"$f":"Inputs!J$12","v":"2029/30"}]
["X value applied",null,{"$f":"C6","v":0}]
["Index of price path",null,null,1,{"$f":"D13*(1+E$8)*(1-$C$6)","v":1.02},{"$f":"E13*(1+F$8)*(1-$C$6)","v":1.0404},{"$f":"F13*(1+G$8)*(1-$C$6)","v":1.0612079999999999},{"$f":"G13*(1+H$8)*(1-$C$6)","v":1.08243216}]
["Index of constant price growth",null,null,1,{"$f":"D14*(1+E$5)","v":1},{"$f":"E14*(1+F$5)","v":1},1,1]
["Indexed maximum allowable revenue before tax",null,null,1,{"$f":"E13*E14","v":1.02},{"$f":"F13*F14","v":1.0404},{"$f":"G13*G14","v":1.0612079999999999},{"$f":"H13*H14","v":1.08243216}]
{"$rows_left_out":14}
{"sheet":"MAR","index":12,"n_rows":61,"n_cols":8,"rows_kept":61,"cut":false,"hidden":false,"merged":[]}
["Maximum allowable revenue",null,null,null,null,null,null,{"$f":"EDB_Name","v":"Vector Lines"}]
["Derivation of starting prices."]
["Inputs"]
[null,"Source","Value",{"$f":"Inputs!F$12","v":"2025/26"},{"$f":"Inputs!G$12","v":"2026/27"},{"$f":"Inputs!H$12","v":"2027/28"},{"$f":"Inputs!I$12","v":"2028/29"},{"$f":"Inputs!J$12","v":"2029/30"}]
["Year in regulatory period","EDB data",null,{"$f":"'EDB data'!D22","v":1},{"$f":"'EDB data'!E22","v":2},{"$f":"'EDB data'!F22","v":3},{"$f":"'EDB data'!G22","v":4},{"$f":"'EDB data'!H22","v":5}]
["Industry-wide X factor","EDB data",{"$f":"'EDB data'!B14","v":0}]
["Additional allowance in 1 April 2015 PV terms","EDB data",{"$f":"'EDB data'!B42","v":0}]
["Alternative X factor","EDB data",{"$f":"'EDB data'!B43","v":-8.5000000000000006E-2}]
["Vanilla WACC (67th percentile)","EDB data",{"$f":"WACC","v":7.3700000000000002E-2}]
["TFrev","TIMING",{"$f":"TIMING!C27","v":1.0292536194556401}]
["Constant price revenue growth 2015","EDB data",{"$f":"'EDB data'!B56","v":0}]
["Constant price revenue growth 2016","EDB data",{"$f":"'EDB data'!B57","v":0}]
["PV at 1 Apr 2015 of BBAR before tax over the regulatory period","BBAR",{"$f":"BBAR!C57","v":2955995.9234370939}]
["Indexed maximum allowable revenue before tax—industry wide X factor","REV",null,{"$f":"REV!D27","v":1},{"$f":"REV!E27","v":1.02},{"$f":"REV!F27","v":1.0404},{"$f":"REV!G27","v":1.0612079999999999},{"$f":"REV!H27","v":1.08243216}]
["Indexed maximum allowable revenue before tax—applicable X factor","REV",null,{"$f":"REV!D28","v":1},{"$f":"REV!E28","v":1.1067},{"$f":"REV!F28","v":1.22478489},{"$f":"REV!G28","v":1.3554694377629999},{"$f":"REV!H28","v":1.5000980267723119}]
{"$rows_left_out":46}