{"text_format":"1","workbook":"xlsx","n_sheets":9,"sheets":["CoverSheet","Table of Contents","Description","Inputs","Calculations","Outputs","External charts","UnlinkedCharts","Outputs - Determination"],"not_rendered":{"charts":33,"images":16,"macros":1,"external_links":12,"defined_names":8,"comments":0,"pivot_tables":0},"unopened":[],"bounds":{"document_bytes":16777216,"sheet_cells":100000,"rows_first":2000,"rows_last":500,"rows_between":2000,"halvings":0,"cell_chars":16384,"cell_head_chars":4096},"cells_cut":0,"cells_raw":0,"read":"whole","date_system":"1900"}

{"sheet":"CoverSheet","index":0,"n_rows":17,"n_cols":1,"rows_kept":17,"cut":false,"hidden":false,"merged":[]}
[]
[]
["Electricity Distribution Business"]
["Price-Quality Regulation 1 April 2020 Reset"]
["Determination and reasons paper table and chart book - EDB DPP3 draft"]
["Draft determination"]
[]
[]
[]
[]
[]
[]
[]
[]
[]
[]
["Published 29 May 2019 v1"]

{"sheet":"Table of Contents","index":1,"n_rows":9,"n_cols":3,"rows_kept":9,"cut":false,"hidden":false,"merged":[]}
["Table of Contents"]
[]
[]
[null,"Sheet Name","Link"]
[null,"Inputs","Inputs"]
[null,"Calculations","Calculations"]
[null,"Outputs","Outputs"]
[null,"External charts","External charts"]
[null,"Outputs - Determination","Outputs - Determination"]

{"sheet":"Description","index":2,"n_rows":19,"n_cols":2,"rows_kept":19,"cut":false,"hidden":false,"merged":[[14,1,14,4],[13,1,13,4],[5,1,6,4],[9,1,9,4],[11,1,11,4],[12,1,12,4],[10,1,10,4]]}
["Description"]
[null,"This model has been prepared and published for consultation purposes only."]
[]
[]
[null,"General description"]
[null,"This Chart book presents all charts and tables of the Electricity Distribution DPP model outputs used in the Draft determination."]
[]
[]
[null,"Notes:"]
[1,"Financial values in the Input sheet are expressed in NZD'000 unless otherwise indicated. "]
[2,"Financial values in the Output sheet may be displayed in units other than '000s."]
[3,"Annual values relate to years ending on 31 March. "]
[4,"All input data are located on the Inputs sheet."]
[5,"All calculations are on the Calculations sheet."]
[6,"All outputs are on the Outputs sheet."]
[7,"Table and Figure identifiers and titles do not match the identifiers and titles in the models or the Reasons paper."]
[]
[null,"Model suite"]
[null,"Data flow map of the draft EDB DPP3 (1 April 2020–31 March 2025) model suite"]

{"sheet":"Inputs","index":3,"n_rows":1029,"n_cols":16,"rows_kept":1029,"cut":false,"hidden":false,"merged":[[321,2,321,3],[882,2,882,3]]}
["Inputs"]
[]
[]
[{"$f":"'[1]Chartbook outputs'!A5","v":"Table 2.2"},{"$f":"'[1]Chartbook outputs'!B5","v":"Starting prices and rates of change"}]
[null,{"$f":"'[1]Chartbook outputs'!B6","v":"Supplier"},{"$f":"'[1]Chartbook outputs'!C6","v":"MAR (industry-wide X factor) 2021"},{"$f":"'[1]Chartbook outputs'!D6","v":"Alternative X factor"}]
[null,{"$f":"'[1]Chartbook outputs'!B7","v":"Alpine Energy"},{"$f":"'[1]Chartbook outputs'!C7","v":45361.380318835836},{"$f":"'[1]Chartbook outputs'!D7","v":0}]
[null,{"$f":"'[1]Chartbook outputs'!B8","v":"Aurora Energy"},{"$f":"'[1]Chartbook outputs'!C8","v":72030.727522350353},{"$f":"'[1]Chartbook outputs'!D8","v":-8.8999999999999996E-2}]
[null,{"$f":"'[1]Chartbook outputs'!B9","v":"Centralines"},{"$f":"'[1]Chartbook outputs'!C9","v":9398.5396333909193},{"$f":"'[1]Chartbook outputs'!D9","v":0}]
[null,{"$f":"'[1]Chartbook outputs'!B10","v":"EA Networks"},{"$f":"'[1]Chartbook outputs'!C10","v":37696.145028874846},{"$f":"'[1]Chartbook outputs'!D10","v":0}]
[null,{"$f":"'[1]Chartbook outputs'!B11","v":"Eastland Network"},{"$f":"'[1]Chartbook outputs'!C11","v":25055.110617462473},{"$f":"'[1]Chartbook outputs'!D11","v":0}]
[null,{"$f":"'[1]Chartbook outputs'!B12","v":"Electricity Invercargill"},{"$f":"'[1]Chartbook outputs'!C12","v":12291.592306373914},{"$f":"'[1]Chartbook outputs'!D12","v":0}]
[null,{"$f":"'[1]Chartbook outputs'!B13","v":"Horizon Energy"},{"$f":"'[1]Chartbook outputs'!C13","v":25008.552216993317},{"$f":"'[1]Chartbook outputs'!D13","v":0}]
[null,{"$f":"'[1]Chartbook outputs'!B14","v":"Nelson Electricity"},{"$f":"'[1]Chartbook outputs'!C14","v":5588.2462797242588},{"$f":"'[1]Chartbook outputs'!D14","v":0}]
[null,{"$f":"'[1]Chartbook outputs'!B15","v":"Network Tasman"},{"$f":"'[1]Chartbook outputs'!C15","v":28780.562999403519},{"$f":"'[1]Chartbook outputs'!D15","v":0}]
[null,{"$f":"'[1]Chartbook outputs'!B16","v":"Orion NZ"},{"$f":"'[1]Chartbook outputs'!C16","v":161170.07066762098},{"$f":"'[1]Chartbook outputs'!D16","v":0}]
[null,{"$f":"'[1]Chartbook outputs'!B17","v":"OtagoNet"},{"$f":"'[1]Chartbook outputs'!C17","v":25084.600581412495},{"$f":"'[1]Chartbook outputs'!D17","v":0}]
[null,{"$f":"'[1]Chartbook outputs'!B18","v":"The Lines Company"},{"$f":"'[1]Chartbook outputs'!C18","v":33943.504018870779},{"$f":"'[1]Chartbook outputs'!D18","v":0}]
[null,{"$f":"'[1]Chartbook outputs'!B19","v":"Top Energy"},{"$f":"'[1]Chartbook outputs'!C19","v":42189.259503444315},{"$f":"'[1]Chartbook outputs'!D19","v":0}]
[null,{"$f":"'[1]Chartbook outputs'!B20","v":"Unison Networks"},{"$f":"'[1]Chartbook outputs'!C20","v":102250.97674098593},{"$f":"'[1]Chartbook outputs'!D20","v":0}]
[null,{"$f":"'[1]Chartbook outputs'!B21","v":"Vector Lines"},{"$f":"'[1]Chartbook outputs'!C21","v":403345.76553164725},{"$f":"'[1]Chartbook outputs'!D21","v":0}]
[]
[]
[{"$f":"'[2]Chartbook outputs'!A45","v":"Figure 5.1"},{"$f":"'[2]Chartbook outputs'!B45","v":"Proposed changes in allowable revenue from 2019/2020 to 2020/2021"}]
[null,{"$f":"'[2]Chartbook outputs'!B46","v":"Distributor"},{"$f":"'[2]Chartbook outputs'!C46","v":"Revenue increase from 2019/20 estimate of allowable revenue to 2020/21 MAR"}]
[null,{"$f":"'[2]Chartbook outputs'!B47","v":"Alpine Energy"},{"$f":"'[2]Chartbook outputs'!C47","v":-7.4860599809896677E-2}]
[null,{"$f":"'[2]Chartbook outputs'!B48","v":"Aurora Energy"},{"$f":"'[2]Chartbook outputs'!C48","v":8.871702152561145E-2}]
[null,{"$f":"'[2]Chartbook outputs'!B49","v":"Centralines"},{"$f":"'[2]Chartbook outputs'!C49","v":-0.338408951379356}]
[null,{"$f":"'[2]Chartbook outputs'!B50","v":"EA Networks"},{"$f":"'[2]Chartbook outputs'!C50","v":2.8055520606493634E-3}]
[null,{"$f":"'[2]Chartbook outputs'!B51","v":"Eastland Network"},{"$f":"'[2]Chartbook outputs'!C51","v":-9.382184791189041E-2}]
[null,{"$f":"'[2]Chartbook outputs'!B52","v":"Electricity Invercargill"},{"$f":"'[2]Chartbook outputs'!C52","v":-9.9369045215007112E-2}]
{"$rows_left_out":1000}
{"sheet":"Calculations","index":4,"n_rows":273,"n_cols":11,"rows_kept":273,"cut":false,"hidden":false,"merged":[]}
["Calculations"]
[]
["Figure 2.1",{"$f":"Inputs!B79","v":"Starting price adjustment"}]
["Inputs"]
[{"$f":"Inputs!A79","v":"Table X.X"},null,{"$f":"Inputs!B80","v":"Distributor"},{"$f":"Inputs!C80","v":"$ difference between first year MAR proposed and hypothetical first-year MAR under a roll-over scenario"},{"$f":"Inputs!D80","v":" % difference between first year MAR proposed and hypothetical first-year MAR under a roll-over scenario"}]
[null,null,{"$f":"Inputs!B81","v":"Alpine Energy"},{"$f":"Inputs!C81","v":-4639.1273961166953},{"$f":"Inputs!D81","v":-9.2781605790162314E-2}]
[null,null,{"$f":"Inputs!B82","v":"Aurora Energy"},{"$f":"Inputs!C82","v":4562.6836877982132},{"$f":"Inputs!D82","v":6.7627330340079381E-2}]
[null,null,{"$f":"Inputs!B83","v":"Centralines"},{"$f":"Inputs!C83","v":-5088.0476270125582},{"$f":"Inputs!D83","v":-0.35122472501993868}]
[null,null,{"$f":"Inputs!B84","v":"EA Networks"},{"$f":"Inputs!C84","v":-637.09600952761684},{"$f":"Inputs!D84","v":-1.6619935916437914E-2}]
[null,null,{"$f":"Inputs!B85","v":"Eastland Network"},{"$f":"Inputs!C85","v":-3140.2768700046508},{"$f":"Inputs!D85","v":-0.11137555287723948}]
[null,null,{"$f":"Inputs!B86","v":"Electricity Invercargill"},{"$f":"Inputs!C86","v":-1625.7595586985517},{"$f":"Inputs!D86","v":-0.11681529463795637}]
[null,null,{"$f":"Inputs!B87","v":"Horizon Energy"},{"$f":"Inputs!C87","v":1181.8045888561246},{"$f":"Inputs!D87","v":4.9599912136582262E-2}]
[null,null,{"$f":"Inputs!B88","v":"Nelson Electricity"},{"$f":"Inputs!C88","v":-1374.4362681356815},{"$f":"Inputs!D88","v":-0.19740039254814656}]
[null,null,{"$f":"Inputs!B89","v":"Network Tasman"},{"$f":"Inputs!C89","v":941.29213899135721},{"$f":"Inputs!D89","v":3.3811666394247701E-2}]
[null,null,{"$f":"Inputs!B90","v":"Orion NZ"},{"$f":"Inputs!C90","v":-10619.626478519291},{"$f":"Inputs!D90","v":-6.1817598231663745E-2}]
[null,null,{"$f":"Inputs!B91","v":"OtagoNet"},{"$f":"Inputs!C91","v":-2715.2822378995334},{"$f":"Inputs!D91","v":-9.7672434648295725E-2}]
[null,null,{"$f":"Inputs!B92","v":"The Lines Company"},{"$f":"Inputs!C92","v":-8384.6394985658189},{"$f":"Inputs!D92","v":-0.19808663460781978}]
[null,null,{"$f":"Inputs!B93","v":"Top Energy"},{"$f":"Inputs!C93","v":-2796.2998408770582},{"$f":"Inputs!D93","v":-6.2159943804945515E-2}]
[null,null,{"$f":"Inputs!B94","v":"Unison Networks"},{"$f":"Inputs!C94","v":-13886.002305123984},{"$f":"Inputs!D94","v":-0.11956572677519722}]
[null,null,{"$f":"Inputs!B95","v":"Vector Lines"},{"$f":"Inputs!C95","v":-22835.220708358625},{"$f":"Inputs!D95","v":-5.3581040557024902E-2}]
[]
["Calculations","Rank",{"$f":"C5","v":"Distributor"},{"$f":"E5","v":" % difference between first year MAR proposed and hypothetical first-year MAR under a roll-over scenario"},"Ordered","Suppliers in % difference order (smallest to largest - will flip in chart)",{"$f":"E5","v":" % difference between first year MAR proposed and hypothetical first-year MAR under a roll-over scenario"}]
[null,{"$f":"_xlfn.RANK.EQ(E6,$E$6:$E$20)+COUNTIF($E$6:E6,E6)-1","v":8},"Alpine Energy",-9.2781605790162314E-2,{"$f":"LARGE($B$23:$B$37,COUNT($B$23:B23))","v":15},{"$f":"VLOOKUP($E23,$B$23:$D$37,2,FALSE)","v":"Centralines"},{"$f":"VLOOKUP($E23,$B$23:$D$37,3,FALSE)","v":-0.35122472501993868}]
[null,{"$f":"_xlfn.RANK.EQ(E7,$E$6:$E$20)+COUNTIF($E$6:E7,E7)-1","v":1},"Aurora Energy",6.7627330340079381E-2,{"$f":"LARGE($B$23:$B$37,COUNT($B$23:B24))","v":14},"The Lines Company",-0.19808663460781978]
[null,{"$f":"_xlfn.RANK.EQ(E8,$E$6:$E$20)+COUNTIF($E$6:E8,E8)-1","v":15},"Centralines",-0.35122472501993868,{"$f":"LARGE($B$23:$B$37,COUNT($B$23:B25))","v":13},"Nelson Electricity",-0.19740039254814656]
[null,{"$f":"_xlfn.RANK.EQ(E9,$E$6:$E$20)+COUNTIF($E$6:E9,E9)-1","v":4},"EA Networks",-1.6619935916437914E-2,{"$f":"LARGE($B$23:$B$37,COUNT($B$23:B26))","v":12},"Unison Networks",-0.11956572677519722]
[null,{"$f":"_xlfn.RANK.EQ(E10,$E$6:$E$20)+COUNTIF($E$6:E10,E10)-1","v":10},"Eastland Network",-0.11137555287723948,{"$f":"LARGE($B$23:$B$37,COUNT($B$23:B27))","v":11},"Electricity Invercargill",-0.11681529463795637]
[null,{"$f":"_xlfn.RANK.EQ(E11,$E$6:$E$20)+COUNTIF($E$6:E11,E11)-1","v":11},"Electricity Invercargill",-0.11681529463795637,{"$f":"LARGE($B$23:$B$37,COUNT($B$23:B28))","v":10},"Eastland Network",-0.11137555287723948]
[null,{"$f":"_xlfn.RANK.EQ(E12,$E$6:$E$20)+COUNTIF($E$6:E12,E12)-1","v":2},"Horizon Energy",4.9599912136582262E-2,{"$f":"LARGE($B$23:$B$37,COUNT($B$23:B29))","v":9},"OtagoNet",-9.7672434648295725E-2]
[null,{"$f":"_xlfn.RANK.EQ(E13,$E$6:$E$20)+COUNTIF($E$6:E13,E13)-1","v":13},"Nelson Electricity",-0.19740039254814656,{"$f":"LARGE($B$23:$B$37,COUNT($B$23:B30))","v":8},"Alpine Energy",-9.2781605790162314E-2]
{"$rows_left_out":244}
{"sheet":"Outputs","index":5,"n_rows":1181,"n_cols":9,"rows_kept":1181,"cut":false,"hidden":false,"merged":[[145,1,146,1],[145,6,146,6],[455,2,455,4],[455,5,455,7]]}
["Outputs"]
["Table X1","Proposed net allowable revenue and rates of change"]
["Table 2.2","Proposed net allowable revenue and rates of change"]
["Table 5.1*","Proposed net allowable revenues for 2020/21",null,null,null,"*Excludes Column D"]
[null,"Starting price is $ formatted in millions"]
[null,"Distributor",{"$f":"IF(Inputs!C5=\"MAR (industry-wide X factor) 2021\",\"Allowable revenue in 2020/21 ($m)\",\"ERROR\")","v":"Allowable revenue in 2020/21 ($m)"},{"$f":"IF(Inputs!D5=\"Alternative X factor\",\"Rate of change (CPI-X)\", \"ERROR\")","v":"Rate of change (CPI-X)"}]
[null,{"$f":"Inputs!B6","v":"Alpine Energy"},{"$f":"Inputs!C6","v":45361.380318835836},{"$f":"Inputs!D6","v":0}]
[null,{"$f":"Inputs!B7","v":"Aurora Energy"},{"$f":"Inputs!C7","v":72030.727522350353},{"$f":"Inputs!D7","v":-8.8999999999999996E-2}]
[null,{"$f":"Inputs!B8","v":"Centralines"},{"$f":"Inputs!C8","v":9398.5396333909193},{"$f":"Inputs!D8","v":0}]
[null,{"$f":"Inputs!B9","v":"EA Networks"},{"$f":"Inputs!C9","v":37696.145028874846},{"$f":"Inputs!D9","v":0}]
[null,{"$f":"Inputs!B10","v":"Eastland Network"},{"$f":"Inputs!C10","v":25055.110617462473},{"$f":"Inputs!D10","v":0}]
[null,{"$f":"Inputs!B11","v":"Electricity Invercargill"},{"$f":"Inputs!C11","v":12291.592306373914},{"$f":"Inputs!D11","v":0}]
[null,{"$f":"Inputs!B12","v":"Horizon Energy"},{"$f":"Inputs!C12","v":25008.552216993317},{"$f":"Inputs!D12","v":0}]
[null,{"$f":"Inputs!B13","v":"Nelson Electricity"},{"$f":"Inputs!C13","v":5588.2462797242588},{"$f":"Inputs!D13","v":0}]
[null,{"$f":"Inputs!B14","v":"Network Tasman"},{"$f":"Inputs!C14","v":28780.562999403519},{"$f":"Inputs!D14","v":0}]
[null,{"$f":"Inputs!B15","v":"Orion NZ"},{"$f":"Inputs!C15","v":161170.07066762098},{"$f":"Inputs!D15","v":0}]
[null,{"$f":"Inputs!B16","v":"OtagoNet"},{"$f":"Inputs!C16","v":25084.600581412495},{"$f":"Inputs!D16","v":0}]
[null,{"$f":"Inputs!B17","v":"The Lines Company"},{"$f":"Inputs!C17","v":33943.504018870779},{"$f":"Inputs!D17","v":0}]
[null,{"$f":"Inputs!B18","v":"Top Energy"},{"$f":"Inputs!C18","v":42189.259503444315},{"$f":"Inputs!D18","v":0}]
[null,{"$f":"Inputs!B19","v":"Unison Networks"},{"$f":"Inputs!C19","v":102250.97674098593},{"$f":"Inputs!D19","v":0}]
[null,{"$f":"Inputs!B20","v":"Vector Lines"},{"$f":"Inputs!C20","v":403345.76553164725},{"$f":"Inputs!D20","v":0}]
[]
[]
["Table 5.2","Net allowable revenue in each year of the regulatory period ($m)"]
[null,"All amouts are $ formatted in millions"]
[null,"Distributor",{"$f":"VALUE(RIGHT(Inputs!D61,4)-1)&\"/\"&RIGHT(Inputs!D61,2)","v":"2020/21"},{"$f":"VALUE(RIGHT(Inputs!E61,4)-1)&\"/\"&RIGHT(Inputs!E61,2)","v":"2021/22"},{"$f":"VALUE(RIGHT(Inputs!F61,4)-1)&\"/\"&RIGHT(Inputs!F61,2)","v":"2022/23"},{"$f":"VALUE(RIGHT(Inputs!G61,4)-1)&\"/\"&RIGHT(Inputs!G61,2)","v":"2023/24"},{"$f":"VALUE(RIGHT(Inputs!H61,4)-1)&\"/\"&RIGHT(Inputs!H61,2)","v":"2024/25"},{"$f":"IF(Inputs!C61=\"PV at 1 Apr 2020 of MAR before tax over the regulatory period (Applicable X)\",\"PV\",\"ERROR\")","v":"PV"}]
[null,{"$f":"Inputs!B62","v":"Alpine Energy"},{"$f":"Inputs!D62","v":45361.380318835836},{"$f":"Inputs!E62","v":46302.607367888457},{"$f":"Inputs!F62","v":47259.527920158151},{"$f":"Inputs!G62","v":48220.471654534704},{"$f":"Inputs!H62","v":49184.881087625385},{"$f":"Inputs!C62","v":207660.39820706175}]
[null,{"$f":"Inputs!B63","v":"Aurora Energy"},{"$f":"Inputs!D63","v":72030.727522350353},{"$f":"Inputs!E63","v":80069.085274899655},{"$f":"Inputs!F63","v":88997.268697562627},{"$f":"Inputs!G63","v":98888.692132415832},{"$f":"Inputs!H63","v":109843.58144684482},{"$f":"Inputs!C63","v":391914.48522305465}]
[null,{"$f":"Inputs!B64","v":"Centralines"},{"$f":"Inputs!D64","v":9398.5396333909193},{"$f":"Inputs!E64","v":9593.5548569657494},{"$f":"Inputs!F64","v":9791.8216573430418},{"$f":"Inputs!G64","v":9990.9220310423498},{"$f":"Inputs!H64","v":10190.740471663195},{"$f":"Inputs!C64","v":43025.685486567651}]
[null,{"$f":"Inputs!B65","v":"EA Networks"},{"$f":"Inputs!D65","v":37696.145028874846},{"$f":"Inputs!E65","v":38478.32209440507},{"$f":"Inputs!F65","v":39273.540751022774},{"$f":"Inputs!G65","v":40072.102746293567},{"$f":"Inputs!H65","v":40873.544801219439},{"$f":"Inputs!C65","v":172569.62712655391}]
{"$rows_left_out":1152}
{"sheet":"External charts","index":6,"n_rows":179,"n_cols":6,"rows_kept":179,"cut":false,"hidden":false,"merged":[]}
["External charts"]
[]
["Figure J3","Distribution of annual SAIDI from target","Stata"]
[]
[]
[]
[]
[]
[]
[]
[]
[]
[]
[]
[]
[]
[]
[]
["Figure J4","Distribution of annual SAIFI from target","Stata"]
[]
[]
[]
[]
[]
[]
[]
[]
[]
[]
[]
{"$rows_left_out":150}
{"sheet":"UnlinkedCharts","index":7,"n_rows":177,"n_cols":8,"rows_kept":177,"cut":false,"hidden":false,"merged":[]}
["Figure A1","Deviations between DPP allowance and actuals, 2016–2018 ($b)"]
[]
[]
[]
[]
[]
[]
[]
[]
[]
[]
[]
[]
[]
[]
[]
[]
[]
[]
[]
[]
[]
[]
["Table A4","Econometric analysis of opex – without removing outliers"]
[null,"Model","Elasticity",null,null,null,null,"R2"]
[null,null,"Lines[1]","ICPs","Delivery[2]","Peak[3]","OH Lines[4]"]
[null,"Total opex",0.36049999999999999,0.53420000000000001,null,null,null,0.94810000000000005]
[null,"Opex categories"]
[null,"Network opex",0.52759999999999996,0.42280000000000001,null,null,null,0.90339999999999998]
[null,"Non-network opex",0.20949999999999999,0.64180000000000004,null,null,null,0.89239999999999997]
{"$rows_left_out":148}
{"sheet":"Outputs - Determination","index":8,"n_rows":221,"n_cols":8,"rows_kept":221,"cut":false,"hidden":false,"merged":[[45,2,45,6]]}
["Outputs - Determination"]
[]
["Table 1.1.1","Table 1.1: Starting prices for the DPP regulatory period"]
[null,"1 April 2020 – 31 March 2025"]
[]
[null,"Non-exempt EDB","Actual net allowable revenue ($000)"]
[null,{"$f":"IF(Inputs!B6=\"Alpine Energy\",\"Alpine Energy Limited\",\"ERROR:check labels\")","v":"Alpine Energy Limited"},{"$f":"Inputs!C6","v":45361.380318835836}]
[null,{"$f":"IF(Inputs!B7=\"Aurora Energy\",\"Aurora Energy Limited\",\"ERROR:check labels\")","v":"Aurora Energy Limited"},{"$f":"Inputs!C7","v":72030.727522350353}]
[null,{"$f":"IF(Inputs!B8=\"Centralines\",\"Centralines Limited\",\"ERROR:check labels\")","v":"Centralines Limited"},{"$f":"Inputs!C8","v":9398.5396333909193}]
[null,{"$f":"IF(Inputs!B9=\"EA Networks\",\"Electricity Ashburton Limited\",\"ERROR:check labels\")","v":"Electricity Ashburton Limited"},{"$f":"Inputs!C9","v":37696.145028874846}]
[null,{"$f":"IF(Inputs!B10=\"Eastland Network\",\"Eastland Network Limited\",\"ERROR:check labels\")","v":"Eastland Network Limited"},{"$f":"Inputs!C10","v":25055.110617462473}]
[null,{"$f":"IF(Inputs!B11=\"Electricity Invercargill\",\"Electricity Invercargill Limited\",\"ERROR:check labels\")","v":"Electricity Invercargill Limited"},{"$f":"Inputs!C11","v":12291.592306373914}]
[null,{"$f":"IF(Inputs!B12=\"Horizon Energy\",\"Horizon Energy Distribution Limited\",\"ERROR:check labels\")","v":"Horizon Energy Distribution Limited"},{"$f":"Inputs!C12","v":25008.552216993317}]
[null,{"$f":"IF(Inputs!B13=\"Nelson Electricity\",\"Nelson Electricity Limited\",\"ERROR:check labels\")","v":"Nelson Electricity Limited"},{"$f":"Inputs!C13","v":5588.2462797242588}]
[null,{"$f":"IF(Inputs!B14=\"Network Tasman\",\"Network Tasman Limited\",\"ERROR:check labels\")","v":"Network Tasman Limited"},{"$f":"Inputs!C14","v":28780.562999403519}]
[null,{"$f":"IF(Inputs!B15=\"Orion NZ\",\"Orion New Zealand Limited\",\"ERROR:check labels\")","v":"Orion New Zealand Limited"},{"$f":"Inputs!C15","v":161170.07066762098}]
[null,{"$f":"IF(Inputs!B16=\"OtagoNet\",\"OtagoNet Joint Venture\",\"ERROR:check labels\")","v":"OtagoNet Joint Venture"},{"$f":"Inputs!C16","v":25084.600581412495}]
[null,{"$f":"IF(Inputs!B17=\"The Lines Company\",\"The Lines Company Limited\",\"ERROR:check labels\")","v":"The Lines Company Limited"},{"$f":"Inputs!C17","v":33943.504018870779}]
[null,{"$f":"IF(Inputs!B18=\"Top Energy\",\"Top Energy Limited\",\"ERROR:check labels\")","v":"Top Energy Limited"},{"$f":"Inputs!C18","v":42189.259503444315}]
[null,{"$f":"IF(Inputs!B19=\"Unison Networks\",\"Unison Networks Limited\",\"ERROR:check labels\")","v":"Unison Networks Limited"},{"$f":"Inputs!C19","v":102250.97674098593}]
[null,{"$f":"IF(Inputs!B20=\"Vector Lines\",\"Vector Limited\",\"ERROR:check labels\")","v":"Vector Limited"},{"$f":"Inputs!C20","v":403345.76553164725}]
[]
[]
["Table 1.4.1","Table 1.4.1: Forecast net allowable revenue for the"]
[null,"Non-exempt EDB","Forecast net allowable revenue ($000)"]
[null,null,"Assessment period ending 31 March 2021","Assessment period ending 31 March 2022","Assessment period ending 31 March 2023","Assessment period ending 31 March 2024","Assessment period ending 31 March 2025","Sum of forecast net allowable revenue for the DPP regulatory period"]
[null,{"$f":"IF(Inputs!B62=\"Alpine Energy\",\"Alpine Energy Limited\",\"ERROR:check labels\")","v":"Alpine Energy Limited"},{"$f":"Inputs!D62","v":45361.380318835836},{"$f":"Inputs!E62","v":46302.607367888457},{"$f":"Inputs!F62","v":47259.527920158151},{"$f":"Inputs!G62","v":48220.471654534704},{"$f":"Inputs!H62","v":49184.881087625385},{"$f":"Inputs!I62","v":236328.86834904255}]
[null,{"$f":"IF(Inputs!B63=\"Aurora Energy\",\"Aurora Energy Limited\",\"ERROR:check labels\")","v":"Aurora Energy Limited"},{"$f":"Inputs!D63","v":72030.727522350353},{"$f":"Inputs!E63","v":80069.085274899655},{"$f":"Inputs!F63","v":88997.268697562627},{"$f":"Inputs!G63","v":98888.692132415832},{"$f":"Inputs!H63","v":109843.58144684482},{"$f":"Inputs!I63","v":449829.3550740733}]
[null,{"$f":"IF(Inputs!B64=\"Centralines\",\"Centralines Limited\",\"ERROR:check labels\")","v":"Centralines Limited"},{"$f":"Inputs!D64","v":9398.5396333909193},{"$f":"Inputs!E64","v":9593.5548569657494},{"$f":"Inputs!F64","v":9791.8216573430418},{"$f":"Inputs!G64","v":9990.9220310423498},{"$f":"Inputs!H64","v":10190.740471663195},{"$f":"Inputs!I64","v":48965.578650405252}]
[null,{"$f":"IF(Inputs!B65=\"EA Networks\",\"Electricity Ashburton Limited\",\"ERROR:check labels\")","v":"Electricity Ashburton Limited"},{"$f":"Inputs!D65","v":37696.145028874846},{"$f":"Inputs!E65","v":38478.32209440507},{"$f":"Inputs!F65","v":39273.540751022774},{"$f":"Inputs!G65","v":40072.102746293567},{"$f":"Inputs!H65","v":40873.544801219439},{"$f":"Inputs!I65","v":196393.6554218157}]
{"$rows_left_out":191}