{"text_format":"1","workbook":"xlsx","n_sheets":19,"sheets":["CoverSheet","Description","Table of Contents","Inputs_AS","Existing","Additional","OpexTax","Total","Inputs_finmod","GPB data","Timing","RAB","Tax","BBAR","Rev","MAR","Reporting","Dashboard","Outputs to Chartbook"],"not_rendered":{"charts":32,"images":2,"macros":1,"external_links":5,"defined_names":59,"comments":0,"pivot_tables":0},"unopened":[],"bounds":{"document_bytes":16777216,"sheet_cells":100000,"rows_first":2000,"rows_last":500,"rows_between":2000,"halvings":0,"cell_chars":16384,"cell_head_chars":4096},"cells_cut":0,"cells_raw":0,"read":"whole","date_system":"1900"}

{"sheet":"CoverSheet","index":0,"n_rows":17,"n_cols":1,"rows_kept":17,"cut":false,"hidden":false,"merged":[]}
[]
[]
["Gas Pipeline Businesses"]
["Price-Quality Regulation 1 October 2022 Reset"]
["Default Price Path Draft Asset Stranding Model"]
[]
[]
[]
[]
[]
{"$rows_left_out":8}
{"sheet":"Description","index":1,"n_rows":23,"n_cols":3,"rows_kept":23,"cut":false,"hidden":false,"merged":[]}
["Description"]
[null,"This model has been prepared and published for consultation purposes only."]
[]
["How this workbook may be operated"]
["This workbook may be operated in a number of ways, as follows:"]
[1,"Running a particular case,i.e, for a chosen GPB and chosen stranding year"]
[null,null,"Select the case using the Dashboard by entering the data at the named ranges \"GPB_name\" and \"Stranding Year\". Other parameters can also be specified, using Columns A and B"]
[null,null,"After making the selections on the dashboard, run the macro \"Update results for the case selected on this dashboard\". This runs the ThreeGoalSeeks macro, which updates the results on the Dashboard. Until this macro is run, the Dashboard results will most likely be invalid."]
[null,null,"Results may be observed on the charts on the dashboard."]
[null,null,"All the values in each of the worksheets from Existing to Total will apply for the chosen combination of GPB and stranding year. Other dashboard selections will also apply."]
{"$rows_left_out":14}
{"sheet":"Table of Contents","index":2,"n_rows":48,"n_cols":3,"rows_kept":48,"cut":false,"hidden":false,"merged":[]}
["Table of Contents"]
[]
[]
[null,"Sheet Name","Link"]
[null,"Inputs_AS","Inputs"]
[null,"Existing","Existing assets"]
[null,null,"Inputs"]
[null,null,"Calculations"]
[null,"Additional","Additional assets"]
[null,"OpexTax","Opex and Tax"]
{"$rows_left_out":39}
{"sheet":"Inputs_AS","index":3,"n_rows":100,"n_cols":54,"rows_kept":100,"cut":false,"hidden":false,"merged":[]}
["Inputs"]
[null,"Chosen supplier",null,{"$f":"GPB_name","v":"First Gas transmission"}]
[null,"Chosen supplier number",null,{"$f":"MATCH(GPB_name,GPBnames,0)","v":5}]
[null,"Post-tax WACC",null,5.6000000000000001E-2,"Do not enter values in any of the 6 cells to the left of this note"]
[null,"Vanilla WACC",null,6.0699999999999997E-2,"that contain formualas rather than values. The cells with a red"]
[null,"Cost of debt",null,4.0099999999999997E-2,"font colour are input cells containing values and can be"]
[null,"Leverage",null,0.42,"amended by users."]
[null,"Tax rate",null,0.28000000000000003]
[null,"Stranding year opex÷2027 opex",null,0.3]
[null,"Stranding year",null,{"$f":"StrandingYear","v":2070}]
{"$rows_left_out":91}
{"sheet":"Existing","index":4,"n_rows":87,"n_cols":56,"rows_kept":87,"cut":false,"hidden":false,"merged":[]}
["Existing assets"]
[{"$f":"GPB_name","v":"First Gas transmission"}]
["Inputs"]
[null,"Mitigation",null,null,null,null,{"$f":"Inputs_AS!D14","v":true}]
[null,"Stranding year",null,null,null,null,{"$f":"Inputs_AS!D10","v":2070}]
[null,"Adjustment Factor",null,null,null,null,{"$f":"AdjFactor","v":0.81289593897997026}]
[null,"Apply revaluations from 2023 onwards",null,null,null,null,{"$f":"Reval","v":true}]
[]
[null,"Forecast changes in CPI used for revaluations"]
[null,null,null,null,2021,2022,2023,2024,2025,2026,2027,2028,2029,2030,2031,2032,2033,2034,2035,2036,2037,2038,2039,2040,2041,2042,2043,2044,2045,2046,2047,2048,2049,2050,2051,2052,2053,2054,2055,2056,2057,2058,2059,2060,2061,2062,2063,2064,2065,2066,2067,2068,2069,2070,2071,2072]
{"$rows_left_out":78}
{"sheet":"Additional","index":5,"n_rows":132,"n_cols":56,"rows_kept":132,"cut":false,"hidden":false,"merged":[]}
["Additional assets"]
["Inputs"]
[null,null,null,{"$f":"Inputs_AS!D2","v":"First Gas transmission"},null,"Timing of \"additional assets\" against the timeliine: In this workbook, additional assets"]
[null,"Chosen supplier number",null,{"$f":"Inputs_AS!D3","v":5},null,"are recorded as occurring in the year in which they enter the RAB. This is the year after"]
[null,"Post-tax WACC",null,{"$f":"Inputs_AS!D5","v":6.0699999999999997E-2},null,"the year during which they are dommissioned."]
[null,"Stranding year",null,{"$f":"Inputs_AS!D10","v":2070}]
[null,"Adjustment factor",null,{"$f":"AdjFactor","v":0.81289593897997026}]
[null,"Remaining life of additional assets, Business As Usual (BAU)",null,{"$f":"Inputs_AS!D12","v":45}]
[null,"Mitigation",null,{"$f":"Mitigation","v":true}]
[null,"Stranding year BBAR ÷ 2023 BBAR",null,{"$f":"Inputs_AS!D13","v":0.2}]
{"$rows_left_out":123}
{"sheet":"OpexTax","index":6,"n_rows":26,"n_cols":51,"rows_kept":26,"cut":false,"hidden":false,"merged":[]}
["Opex and Tax",null,null,null,null,null,null,null,null,null,null,{"$f":"GPB_name","v":"First Gas transmission"}]
["Inputs"]
["Supplier number",null,null,{"$f":"SupplierNum","v":5}]
["Stranding Year",null,null,{"$f":"Inputs_AS!D10","v":2070}]
[]
["Opex"]
[]
["2026 & 2027 opex",null,null,{"$f":"Inputs_finmod!K48","v":58702.297091647117}]
["Stranding year opex÷2027 opex",null,null,{"$f":"Inputs_AS!D9","v":0.3}]
["Stranding year opex",null,null,{"$f":"D8*D9","v":17610.689127494134}]
{"$rows_left_out":17}
{"sheet":"Total","index":7,"n_rows":71,"n_cols":55,"rows_kept":71,"cut":false,"hidden":false,"merged":[]}
["Total"]
["Inputs"]
[null,"Chosen supplier",null,{"$f":"Inputs_AS!D2","v":"First Gas transmission"}]
[null,"Chosen supplier number",null,{"$f":"Inputs_AS!D3","v":5}]
[null,"Post-tax WACC",null,{"$f":"Inputs_AS!D4","v":5.6000000000000001E-2}]
[null,"Vanilla WACC",null,{"$f":"Inputs_AS!D5","v":6.0699999999999997E-2}]
[null,"Cost of debt",null,{"$f":"Inputs_AS!D6","v":4.0099999999999997E-2}]
[null,"Leverage",null,{"$f":"Inputs_AS!D7","v":0.42}]
[null,"Tax rate",null,{"$f":"Inputs_AS!D8","v":0.28000000000000003}]
[null,"Stranding year",null,{"$f":"Inputs_AS!D10","v":2070}]
{"$rows_left_out":62}
{"sheet":"Inputs_finmod","index":8,"n_rows":88,"n_cols":11,"rows_kept":88,"cut":false,"hidden":false,"merged":[]}
["Inputs","Values, not time series","Early base year","Standard base year","Gap year","1st BBAR year","2nd BBAR year","3rd BBAR year","4th BBAR year","5th BBAR year"]
["All input data is entered into this worksheet.","Exceptions to the principle that an inputs sheet should not include anything other than inputs have this grey background."]
["Name of supplier currently chosen as the focus of this workbook",null,{"$f":"GPB_name","v":"First Gas transmission"}]
["Supplier number (inferred from chosen name above)",null,{"$f":"HLOOKUP(GPB_name,Inputs_finmod!$B$21:$F$22,2,FALSE)","v":5}]
[]
["Inputs that are the same for all suppliers"]
["BBAR year ending in calendar year:",null,{"$f":"D7-1","v":2020},{"$f":"E7-1","v":2021},{"$f":"F7-1","v":2022},2023,{"$f":"F7+1","v":2024},{"$f":"G7+1","v":2025},{"$f":"H7+1","v":2026},{"$f":"I7+1","v":2027}]
["Forecast changes in CPI used for revaluations, June year-ends",null,null,{"$f":"[1]Output!G8","v":3.3428844317096473E-2},{"$f":"[1]Output!H8","v":5.2000000000000046E-2},{"$f":"[1]Output!I8","v":2.4999999999999911E-2},{"$f":"[1]Output!J8","v":2.0999999999999908E-2},{"$f":"[1]Output!K8","v":2.0000000000000018E-2},{"$f":"[1]Output!L8","v":2.0000000000000018E-2},{"$f":"[1]Output!M8","v":2.0000000000000018E-2}]
["Forecast changes in CPI used for revaluations, September year-ends",null,null,{"$f":"[1]Output!G9","v":4.933586337760909E-2},{"$f":"[1]Output!H9","v":4.0000000000000036E-2},{"$f":"[1]Output!I9","v":2.2999999999999909E-2},{"$f":"[1]Output!J9","v":2.0000000000000018E-2},{"$f":"[1]Output!K9","v":2.0000000000000018E-2},{"$f":"[1]Output!L9","v":2.0000000000000018E-2},{"$f":"[1]Output!M9","v":2.0000000000000018E-2}]
["Forecast changes in the CPI element of the price path",null,null,{"$f":"IF($C$3=\"First Gas Transmission\",[1]Output!G11,[1]Output!G10)","v":2.811532046700016E-2},{"$f":"IF($C$3=\"First Gas Transmission\",[1]Output!H11,[1]Output!H10)","v":5.1388876013904961E-2},{"$f":"IF($C$3=\"First Gas Transmission\",[1]Output!I11,[1]Output!I10)","v":2.7462102878651029E-2},{"$f":"IF($C$3=\"First Gas Transmission\",[1]Output!J11,[1]Output!J10)","v":2.0747562360831084E-2},{"$f":"IF($C$3=\"First Gas Transmission\",[1]Output!K11,[1]Output!K10)","v":2.0000000000000018E-2},{"$f":"IF($C$3=\"First Gas Transmission\",[1]Output!L11,[1]Output!L10)","v":2.0000000000000018E-2},{"$f":"IF($C$3=\"First Gas Transmission\",[1]Output!M11,[1]Output!M10)","v":2.0000000000000018E-2}]
{"$rows_left_out":79}
{"sheet":"GPB data","index":9,"n_rows":94,"n_cols":10,"rows_kept":94,"cut":false,"hidden":false,"merged":[]}
["GPB data","Values, not time series","Early base year","Standard base year","Gap year","1st BBAR year","2nd BBAR year","3rd BBAR year","4th BBAR year","5th BBAR year"]
["Data from the Inputs sheet that relates to the selected supplier. The supplier's name is user-selected in cell C3 on the Inputs sheet.",null,{"$f":" TEXT(EOMONTH($B$17+1,-25)+1,\"dd.mm.yy\")  & \" to \" & TEXT(EOMONTH($B$17,-12),\"dd.mm.yy\")","v":"01.10.19 to 30.09.20"},{"$f":" TEXT(EOMONTH($B$17+1,-13)+1,\"dd.mm.yy\")  & \" to \" & TEXT(EOMONTH($B$17,0),\"dd.mm.yy\")","v":"01.10.20 to 30.09.21"},{"$f":" TEXT(EOMONTH($B$17+1,-1)+1,\"dd.mm.yy\")  & \" to \" & TEXT(EOMONTH($B$17,12),\"dd.mm.yy\")","v":"01.10.21 to 30.09.22"},{"$f":" TEXT(EOMONTH($B$17+1,11)+1,\"dd.mm.yy\")  & \" to \" & TEXT(EOMONTH($B$17,24),\"dd.mm.yy\")","v":"01.10.22 to 30.09.23"},{"$f":" TEXT(EOMONTH($B$17+1,23)+1,\"dd.mm.yy\")  & \" to \" & TEXT(EOMONTH($B$17,36),\"dd.mm.yy\")","v":"01.10.23 to 30.09.24"},{"$f":" TEXT(EOMONTH($B$17+1,35)+1,\"dd.mm.yy\")  & \" to \" & TEXT(EOMONTH($B$17,36),\"dd.mm.yy\")","v":"01.10.24 to 30.09.24"},{"$f":" TEXT(EOMONTH($B$17+1,47)+1,\"dd.mm.yy\")  & \" to \" & TEXT(EOMONTH($B$17,36),\"dd.mm.yy\")","v":"01.10.25 to 30.09.24"},{"$f":" TEXT(EOMONTH($B$17+1,59)+1,\"dd.mm.yy\")  & \" to \" & TEXT(EOMONTH($B$17,36),\"dd.mm.yy\")","v":"01.10.26 to 30.09.24"}]
["Supplier",null,null,null,null,null,null,null,null,{"$f":"GPB_name","v":"First Gas transmission"}]
["Supplier number",null,{"$f":"Inputs_finmod!C4","v":5}]
["General data"]
["Non business-specific single inputs"]
[{"$f":"Inputs_finmod!A15","v":"Vanilla WACC (67th percentile)"},{"$f":"Inputs_finmod!B15","v":6.0699999999999997E-2}]
[{"$f":"Inputs_finmod!A16","v":"Cost of debt"},{"$f":"Inputs_finmod!B16","v":4.0099999999999997E-2}]
[{"$f":"Inputs_finmod!A17","v":"Leverage"},{"$f":"Inputs_finmod!B17","v":0.42}]
[{"$f":"Inputs_finmod!A18","v":"Remaining asset life for additional assets before adjustment"},{"$f":"Inputs_finmod!B18","v":45},"years"]
{"$rows_left_out":85}
{"sheet":"Timing","index":10,"n_rows":32,"n_cols":10,"rows_kept":32,"cut":false,"hidden":false,"merged":[]}
["Timing",null,null,null,null,"1st BBAR year","2nd BBAR year","3rd BBAR year","4th BBAR year","5th BBAR year"]
["Calculations related to timing",null,null,null,null,null,null,null,null,{"$f":"GPB_name","v":"First Gas transmission"}]
["Inputs"]
["Days from mid-year to year-end",null,{"$f":"'GPB data'!B12","v":182}]
["Days from revenue date to year-end",null,{"$f":"'GPB data'!B13","v":148}]
["Vanilla WACC (67th percentile)",null,{"$f":"WACC","v":6.0699999999999997E-2}]
[{"$f":"'GPB data'!A17","v":"Last day in the standard base year"},null,{"$f":"'GPB data'!B17","v":"2021-09-30"}]
[{"$f":"'GPB data'!A14","v":"Day prior to start of the regulatory period"},null,{"$f":"'GPB data'!B14","v":"2022-09-30"}]
["Calculations"]
["Year-end of 1st BBAR year",null,{"$f":"EOMONTH(C7,24)","v":"2023-09-30"}]
{"$rows_left_out":23}
{"sheet":"RAB","index":11,"n_rows":105,"n_cols":10,"rows_kept":105,"cut":false,"hidden":false,"merged":[]}
["Regulatory asset base","Values, not time series","Early base year","Standard base year","Gap year","1st BBAR year","2nd BBAR year","3rd BBAR year","4th BBAR year","5th BBAR year"]
["Calculations relating to RAB values for full years"]
["Inputs",null,null,null,null,null,null,null,null,{"$f":"GPB_name","v":"First Gas transmission"}]
["BBAR year ending in calendar year:",null,{"$f":"'GPB data'!C18","v":2020},{"$f":"'GPB data'!D18","v":2021},{"$f":"'GPB data'!E18","v":2022},{"$f":"'GPB data'!F18","v":2023},{"$f":"'GPB data'!G18","v":2024},{"$f":"'GPB data'!H18","v":2025},{"$f":"'GPB data'!I18","v":2026},{"$f":"'GPB data'!J18","v":2027}]
["Opening RAB",null,{"$f":"'GPB data'!C32","v":834976.33187042363},{"$f":"'GPB data'!D32","v":"~"}]
["Total depreciation",null,{"$f":"'GPB data'!C33","v":34953.915665600005},{"$f":"'GPB data'!D33","v":"~"}]
["Closing RAB",null,{"$f":"'GPB data'!C34","v":849688.09291020641},{"$f":"'GPB data'!D34","v":"~"}]
["Value of disposed assets",null,null,{"$f":"'GPB data'!D86","v":35.281245776679526},{"$f":"'GPB data'!E86","v":36.692495607746707},{"$f":"'GPB data'!F86","v":37.536423006724881},{"$f":"'GPB data'!G86","v":38.287151466859378},{"$f":"'GPB data'!H86","v":39.052894496196572},{"$f":"'GPB data'!I86","v":39.833952386120501},{"$f":"'GPB data'!J86","v":40.630631433842908}]
["Value of commissioned assets",null,null,{"$f":"'GPB data'!D75","v":35101.66749467708},{"$f":"'GPB data'!E75","v":53794.260204797407},{"$f":"'GPB data'!F75","v":58641.397464321701},{"$f":"'GPB data'!G75","v":48315.708183236937},{"$f":"'GPB data'!H75","v":41557.544685492008},{"$f":"'GPB data'!I75","v":43513.371027242836},{"$f":"'GPB data'!J75","v":45771.865724694719}]
["Remaining life for additional assets before adjustment factor",{"$f":"'GPB data'!B10","v":45}]
{"$rows_left_out":96}
{"sheet":"Tax","index":12,"n_rows":107,"n_cols":10,"rows_kept":107,"cut":false,"hidden":false,"merged":[]}
["Tax calculations","Values, not time series","Early base year","Standard base year","Gap year","1st BBAR year","2nd BBAR year","3rd BBAR year","4th BBAR year","5th BBAR year"]
["Calculation of adjusted depreciation, tax depreciation, deferred tax, notional deductible interest and regulatory tax adjustments."]
["Inputs",null,null,null,null,null,null,null,null,{"$f":"GPB_name","v":"First Gas transmission"}]
["BBAR year ending in calendar year:",null,{"$f":"'GPB data'!C18","v":2020},{"$f":"'GPB data'!D18","v":2021},{"$f":"'GPB data'!E18","v":2022},{"$f":"'GPB data'!F18","v":2023},{"$f":"'GPB data'!G18","v":2024},{"$f":"'GPB data'!H18","v":2025},{"$f":"'GPB data'!I18","v":2026},{"$f":"'GPB data'!J18","v":2027}]
["Corporate tax rate",null,{"$f":"'GPB data'!C22","v":0.28000000000000003},{"$f":"'GPB data'!D22","v":0.28000000000000003},{"$f":"'GPB data'!E22","v":0.28000000000000003},{"$f":"'GPB data'!F22","v":0.28000000000000003},{"$f":"'GPB data'!G22","v":0.28000000000000003},{"$f":"'GPB data'!H22","v":0.28000000000000003},{"$f":"'GPB data'!I22","v":0.28000000000000003},{"$f":"'GPB data'!J22","v":0.28000000000000003}]
["Value of commissioned assets",null,{"$f":"'GPB data'!C75","v":37682.303017200014},{"$f":"'GPB data'!D75","v":35101.66749467708},{"$f":"'GPB data'!E75","v":53794.260204797407},{"$f":"'GPB data'!F75","v":58641.397464321701},{"$f":"'GPB data'!G75","v":48315.708183236937},{"$f":"'GPB data'!H75","v":41557.544685492008},{"$f":"'GPB data'!I75","v":43513.371027242836},{"$f":"'GPB data'!J75","v":45771.865724694719}]
["Remaining life for additional assets",null,null,{"$f":"RAB!D20","v":22.887919735761333},{"$f":"RAB!E20","v":21.887919735761333},{"$f":"RAB!F20","v":16.418392943879873},{"$f":"RAB!G20","v":15.418392943879873},{"$f":"RAB!H20","v":14.418392943879873},{"$f":"RAB!I20","v":13.418392943879873},{"$f":"RAB!J20","v":12.418392943879873}]
["Amortisation of initial differences in asset values",{"$f":"'GPB data'!B41","v":0}]
["Value of disposed assets",null,null,{"$f":"'GPB data'!D86","v":35.281245776679526},{"$f":"'GPB data'!E86","v":36.692495607746707},{"$f":"'GPB data'!F86","v":37.536423006724881},{"$f":"'GPB data'!G86","v":38.287151466859378},{"$f":"'GPB data'!H86","v":39.052894496196572},{"$f":"'GPB data'!I86","v":39.833952386120501},{"$f":"'GPB data'!J86","v":40.630631433842908}]
["Opening RAB excluding revaluations",null,{"$f":"'GPB data'!C35","v":0},{"$f":"'GPB data'!D35","v":"~"}]
{"$rows_left_out":98}
{"sheet":"BBAR","index":13,"n_rows":95,"n_cols":11,"rows_kept":95,"cut":false,"hidden":false,"merged":[]}
["Building blocks allowable revenue","Values, not time series","Early base year","Std base year","Gap year","1st BBAR year","2nd BBAR year","3rd BBAR year","4th BBAR year","5th BBAR year"," "]
["Calculation of BBAR present value, opening investment value, and TCSD allowance."]
["Inputs",null,null,null,null,null,null,null,null,{"$f":"GPB_name","v":"First Gas transmission"}]
["Tax payable (payable) or deferred tax (deferred)",{"$f":"'GPB data'!B27","v":"payable"}]
["Vanilla WACC (67th percentile)",{"$f":"WACC","v":6.0699999999999997E-2}]
["Term credit spread differential allowance",null,{"$f":"'GPB data'!C39","v":0},{"$f":"'GPB data'!D39","v":"~"}]
["BBAR year ending in calendar year:",null,null,{"$f":"'GPB data'!D18","v":2021},{"$f":"'GPB data'!E18","v":2022},{"$f":"'GPB data'!F18","v":2023},{"$f":"'GPB data'!G18","v":2024},{"$f":"'GPB data'!H18","v":2025},{"$f":"'GPB data'!I18","v":2026},{"$f":"'GPB data'!J18","v":2027}]
["Corporate tax rate",null,null,null,null,{"$f":"'GPB data'!F22","v":0.28000000000000003},{"$f":"'GPB data'!G22","v":0.28000000000000003},{"$f":"'GPB data'!H22","v":0.28000000000000003},{"$f":"'GPB data'!I22","v":0.28000000000000003},{"$f":"'GPB data'!J22","v":0.28000000000000003}]
["Other regulated income",null,null,null,null,{"$f":"'GPB data'!F94","v":0},{"$f":"'GPB data'!G94","v":0},{"$f":"'GPB data'!H94","v":0},{"$f":"'GPB data'!I94","v":0},{"$f":"'GPB data'!J94","v":0}]
[]
{"$rows_left_out":86}
{"sheet":"Rev","index":14,"n_rows":28,"n_cols":9,"rows_kept":28,"cut":false,"hidden":false,"merged":[]}
["Revenue growth index",null,null,"Values, not time series",null,"1st revenue year","2nd revenue year","3rd revenue year","4th revenue year"]
["Calculation of the normalised profile of the maximum allowable revenue before tax values.",null,null,null,null,null,null,null,{"$f":"GPB_name","v":"First Gas transmission"}]
["Inputs"]
["Pricing year ending in calendar year:",null,null,null,2022,2023,2024,2025,2026]
["Constant price revenue growth",null,null,null,null,null,{"$f":"'GPB data'!G63","v":0},{"$f":"'GPB data'!H63","v":0},{"$f":"'GPB data'!I63","v":0}]
["Industry-wide X factor",null,null,{"$f":"'GPB data'!B11","v":0}]
["Alternative X factor",null,null,{"$f":"'GPB data'!B42","v":-8.1722672345054703E-2}]
[]
["Forecast changes in the CPI element of the price path, no lag",null,null,null,null,null,{"$f":"'GPB data'!G21","v":2.0747562360831084E-2},{"$f":"'GPB data'!H21","v":2.0000000000000018E-2},{"$f":"'GPB data'!I21","v":2.0000000000000018E-2}]
["Total revenue cap (TRC) or weighted average price cap (WAPC)",null,null,{"$f":"'GPB data'!B28","v":"TRC_FQ"}]
{"$rows_left_out":19}
{"sheet":"MAR","index":15,"n_rows":57,"n_cols":9,"rows_kept":57,"cut":false,"hidden":false,"merged":[]}
["Maximum allowable revenue",null,"Values, not time series",null,null,"1st Revenue year","2nd Revenue year","3rd Revenue year","4th Revenue year"]
["Calculation of starting prices.",null,null,null,null,null,null,null,{"$f":"GPB_name","v":"First Gas transmission"}]
["Inputs"]
["Pricing year ending in calendar year:",null,null,null,null,2023,2024,2025,2026]
["Year in regulatory period",null,null,null,null,1,{"$f":"F5+1","v":2},{"$f":"G5+1","v":3},{"$f":"H5+1","v":4}]
["Industry-wide X factor",null,{"$f":"Inputs_finmod!B19","v":0}]
["Alternative X factor",null,{"$f":"'GPB data'!B42","v":-8.1722672345054703E-2}]
["Vanilla WACC (67th percentile)",null,{"$f":"WACC","v":6.0699999999999997E-2}]
["TFrev",null,{"$f":"Timing!C27","v":1.024182287603089}]
["Constant price revenue growth in year ending 2022",null,{"$f":"'GPB data'!E63","v":0}]
{"$rows_left_out":48}
{"sheet":"Reporting","index":16,"n_rows":71,"n_cols":43,"rows_kept":71,"cut":false,"hidden":false,"merged":[]}
["Reporting"]
["Inputs"]
["GPB:",{"$f":"GPB_name","v":"First Gas transmission"},null,null,"Short name:",null,{"$f":"IF(B3=\"GasNet\",\"Gnt\",IF(B3=\"Powerco\",\"Pco\",IF(B3=\"Vector\",\"Vct\",IF(B3=\"First Gas Distribution\",\"FGD\",IF(B3=\"First Gas Transmission\",\"FGT\",\"Wrong GPB name\")))))","v":"FGT"}]
["Stranding year",{"$f":"StrandingYear","v":2070}]
[null,null,null,null,"GasNet","Powerco","Vector","First Gas distribution","First Gas transmission"]
["2022 MAR from 2017 financial model",null,null,null,{"$f":"Inputs_AS!D16","v":4383.9982678933238},{"$f":"Inputs_AS!E16","v":51435.568618416459},{"$f":"Inputs_AS!F16","v":50702.277198411044},{"$f":"Inputs_AS!G16","v":24646.151307304975},{"$f":"Inputs_AS!H16","v":131623.38640956243}]
[]
[null,null,null,null,2022,2023,2024,2025,2026]
["Price path CPI increase",null,null,null,null,{"$f":"Inputs_AS!G25","v":2.7462102878651029E-2},{"$f":"Inputs_AS!H25","v":2.0747562360831084E-2},{"$f":"Inputs_AS!I25","v":2.0000000000000018E-2},{"$f":"Inputs_AS!J25","v":2.0000000000000018E-2}]
["Constant price revenue growth",null,null,null,null,{"$f":"'GPB data'!F63","v":0},{"$f":"'GPB data'!G63","v":0},{"$f":"'GPB data'!H63","v":0},{"$f":"'GPB data'!I63","v":0}]
{"$rows_left_out":62}
{"sheet":"Dashboard","index":17,"n_rows":30,"n_cols":20,"rows_kept":30,"cut":false,"hidden":false,"merged":[]}
["Dashboard",null,null,null,null,null,null,null,null,null,null,null,null,null,"Working area"]
["Case selection","Option selected",null,"Results, single case",null,null,null,null,null,null,null,null,null,null,null,"Cessation and stranding years"]
["GPB:","First Gas transmission",null,null,null,null,null,null,null,null,null,null,null,null,null,2040,null,"Stranding years",null,2040]
[null,null,null,null,null,null,null,null,null,null,null,null,null,null,null,2050,null,null,null,2050]
["Stranding year",2070,null,null,null,"Closing RAB",null,null,null,null,null,null,null,null,null,2060,null,null,null,2060]
["Max Stranding Year",2070,null,"2040 closing RAB",null,{"$f":"Total!D36","v":904157.48509182222},null,null,null,null,null,null,null,null,null,2070,null,null,null,2070]
["Years in MAR ramp-up",6,null,"2050 closing RAB",null,{"$f":"Total!D37","v":592575.13197315799}]
["MAR ramp-down start",2029,null,"2060 closing RAB",null,{"$f":"Total!D38","v":334853.23171532282},null,null,null,null,null,null,null,"The panel below in this box is for the goal-seeks done by the vba routine \"Three"]
["Mitigation",true,null,"2070 closing RAB",null,{"$f":"Total!D39","v":0},null,null,null,null,null,null,null,"goal seeks\". The named ranges (green fill colour) \"DiffInDepn\","]
["Stranding year MAR ÷ 2023 MAR",0.2,null,null,null,null,null,null,null,null,null,null,null,"\"DiffTotalAssetsAndTotalDMR\" and \"MARincDiff\" have a green fill colour,"]
{"$rows_left_out":21}
{"sheet":"Outputs to Chartbook","index":18,"n_rows":38,"n_cols":6,"rows_kept":38,"cut":false,"hidden":false,"merged":[]}
["Outputs to chartbook"]
[]
["Chapter 6"]
[]
["Table 6.1 ","RAB under current policy settings ($ Million) – 2020 existing assets only"]
["Supplier","2020 Existing",2040,2050,2060,2070]
["GasNet",24.056000000000001,16.252059680744857,10.270175613207897,5.8346832296642948,2.300680776795446]
["Powerco",387.50549067092908,177.13591911929214,86.402590536850838,27.738975612296446,5.5614169670561342]
["Vector",434.25599999999997,346.85244324261254,248.2942165407355,139.04023464565466,50.005839579914365]
["First Gas distribution",174.40530182224549,113.74702548877363,81.38676339636342,58.205863612338995,29.897037790350016]
{"$rows_left_out":28}