{"text_format":"1","workbook":"xlsx","n_sheets":14,"sheets":["CoverSheet","Table of Contents","Description","Waterfall","WfallCht","Inputs","EDB data","TIMING","RAB","TAX","BBAR","REV","MAR","Reconciliation"],"not_rendered":{"charts":1,"images":18,"macros":1,"external_links":2,"defined_names":32,"comments":2,"pivot_tables":0},"unopened":[],"bounds":{"document_bytes":16777216,"sheet_cells":100000,"rows_first":2000,"rows_last":500,"rows_between":2000,"halvings":0,"cell_chars":16384,"cell_head_chars":4096},"cells_cut":0,"cells_raw":0,"read":"whole","date_system":"1900"}

{"sheet":"CoverSheet","index":0,"n_rows":17,"n_cols":1,"rows_kept":17,"cut":false,"hidden":false,"merged":[]}
[]
[]
["Electricity Distribution Business"]
["Price-Quality Regulation 1 April 2020 Reset"]
["MAR Waterfall model"]
["Draft determination"]
[]
[]
[]
[]
{"$rows_left_out":8}
{"sheet":"Table of Contents","index":1,"n_rows":37,"n_cols":3,"rows_kept":37,"cut":false,"hidden":false,"merged":[]}
["Table of Contents"]
[]
[]
[null,"Sheet Name","Link"]
[null,"Waterfall","Waterfall calculations and chart for chosen EDB"]
[null,null,"EDB names and values of MAR 2019/20"]
[null,null,"Waterfall chart for chosen EDB"]
[null,"WfallCht","Display of waterfall charts for 15 non-exempt EDBs"]
[null,"Inputs","Inputs"]
[null,"EDB data","Inputs for the selected distributor"]
{"$rows_left_out":28}
{"sheet":"Description","index":2,"n_rows":87,"n_cols":3,"rows_kept":87,"cut":false,"hidden":false,"merged":[[46,1,46,5],[43,2,43,5],[44,2,44,5],[81,2,81,5],[82,2,82,5],[72,2,72,5],[78,2,78,5],[74,2,74,5],[70,2,70,5],[71,2,71,5],[73,2,73,5],[83,2,83,5],[58,2,58,5],[48,2,48,5],[49,2,49,5],[50,2,50,5],[51,2,51,5],[52,2,52,5],[53,2,53,5],[54,2,54,5],[55,2,55,5],[56,2,56,5],[57,2,57,5],[59,2,59,5],[65,2,65,5],[60,2,60,5],[61,2,61,5],[3,1,3,5],[11,2,11,5],[10,2,10,5],[13,2,13,5],[42,2,42,5],[9,2,9,5],[16,2,16,5],[12,2,12,5],[6,2,6,5]]}
["Description"]
[null,"This model has been prepared and published for consultation purposes only."]
["Purpose"]
[null,"This waterfall model produces a waterfall chart for each non-exempt EDB to show a breakdown of the  drivers of the change in the building blocks allowable revenue (BBAR) from the 2015 reset to the BBAR for the 2020 rest. A waterfall chart for each of the 17 EDBs is on the 'WaterfallCht' sheet."]
[]
["Version"]
[null,null,"Excludes Orion, Powerco, Wellington as these EDBs are on CPPs and charts for them cannot be prepared by this model. Added chart for total of non-exempts except those on CPPs."]
[]
["Overview of model structure"]
[null,1,"This model incorporates a copy of much of the 2015 EDB DPP reset financial model. The sheets from 'Inputs' to 'MAR' are the copied sheets."]
{"$rows_left_out":78}
{"sheet":"Waterfall","index":3,"n_rows":63,"n_cols":19,"rows_kept":63,"cut":false,"hidden":false,"merged":[]}
["Waterfall calculations and chart for chosen EDB"]
[]
["EDB",null,null,"Total for selected EDBs"]
["Distributor number",null,null,{"$f":"MATCH(WfallEDB,EDBnames,0)","v":15}]
["Chosen mode",null,null,14]
[]
["EDB names and values of MAR 2019/20"]
[]
[null,1,2,3,4,5,6,7,8,9,10,11,12,13,14,15]
[null,"Alpine Energy","Aurora Energy","Centralines","EA Networks","Eastland Network","Electricity Invercargill","Horizon Energy","Nelson Electricity","Network Tasman","OtagoNet","The Lines Company","Top Energy","Unison Networks","Vector Lines","Total for selected EDBs"]
{"$rows_left_out":54}
{"sheet":"WfallCht","index":4,"n_rows":5,"n_cols":50,"rows_kept":5,"cut":false,"hidden":false,"merged":[]}
["Display of waterfall charts for 15 non-exempt EDBs"]
[]
[null,null,null,null,null,null,null,null,null,null,null,null,null,null,null,null,null,null,null,null,null,null,null,null,null,null,null,null,null,null,null,null,null,null,null,null,null,null,null,null,null,null,null,null,null,null,null,null,null,"Waterfall Charts"]
[null,null,null,null,null,null,null,null,null,null,null,null,null,null,null,null,null,null,null,null,null,null,null,null,null,null,null,null,null,null,null,null,null,null,null,null,null,null,null,null,null,null,null,null,null,null,null,null,null,"An aid to interpreting these charts is on the Description sheet, under the headings 'Waterfall Chart' and 'Input categories'."]
[null,null,null,null,null,null,null,null,null,null,null,null,null,null,null,null,null,null,null,null,null,null,null,null,null,null,null,null,null,null,null,null,null,null,null,null,null,null,null,null,null,null,null,null,null,null,null,null,null,"The chart \"Total for selected EDBs\" is for all non-exempt EDBs except those on a CPP, ie, except Orion, Powerco and Wellington."]

{"sheet":"Inputs","index":5,"n_rows":92,"n_cols":55,"rows_kept":92,"cut":false,"hidden":false,"merged":[]}
["Inputs"]
["A","Choice of which EDB to consider and the chosen 'mode'."]
[null,"All input data is entered into this worksheet"]
[null,"Waterfall chart parameters"]
[null,"Chosen mode",{"$f":"Waterfall!D5","v":14}]
[]
[]
[]
[]
["B","Values for chosen mode",null,null,null,null,null,null,null,null,null,null,null,null,null,null,null,null,null,null,"C","Values for 2020 reset model",null,null,null,null,null,null,null,null,null,null,null,null,null,null,null,null,"D","Values for 2015 reset model"]
{"$rows_left_out":83}
{"sheet":"EDB data","index":6,"n_rows":88,"n_cols":8,"rows_kept":88,"cut":false,"hidden":false,"merged":[]}
["Inputs for the selected distributor",null,null,null,null,null,null,{"$f":"EDB_Name","v":"Total for selected EDBs"}]
["Data from the Inputs sheet that relates to the selected distributor. The distributor's name is user-selected in cell C4."]
["Distributor",null,"Scenario"]
["Name",null,{"$f":"Waterfall!D3","v":"Total for selected EDBs"}]
["Distributor number",null,{"$f":"Reconciliation!C6","v":14}]
["Distributor number (for output data table)",null,{"$f":"HLOOKUP(EDB_Name,Inputs!$C$28:$S$29,2)","v":14}]
[]
["General data"]
["Non business-specific single inputs","Value"]
[{"$f":"Inputs!B22","v":"Vanilla WACC (67th percentile)"},{"$f":"Inputs!C22","v":5.1299999999999998E-2}]
{"$rows_left_out":79}
{"sheet":"TIMING","index":7,"n_rows":43,"n_cols":15,"rows_kept":43,"cut":false,"hidden":false,"merged":[]}
["Intra-year timing"]
["Derivation of the five timing factors TFopex, TFtax, TFVCA, TFori and TFrev."]
["Inputs"]
[null,"From","Value"]
["Last day of year 1 of the DPP period","EDB data",{"$f":"'EDB data'!B18","v":"2021-03-31"}]
["Days in a year","EDB data",{"$f":"'EDB data'!B15","v":365}]
["Days from mid-year to year-end","EDB data",{"$f":"'EDB data'!B16","v":182}]
["Days from revenue date to year-end","EDB data",{"$f":"'EDB data'!B17","v":148}]
["Vanilla WACC (67th percentile)","EDB data",{"$f":"WACC","v":5.1299999999999998E-2}]
["Calculations"]
{"$rows_left_out":34}
{"sheet":"RAB","index":8,"n_rows":95,"n_cols":10,"rows_kept":95,"cut":false,"hidden":false,"merged":[]}
["Regulatory asset base",null,null,null,null,null,null,null,null,{"$f":"EDB_Name","v":"Total for selected EDBs"}]
["Calculations involving the roll-forward of asset values."]
["Inputs"]
[null,"From","Value",{"$f":"Inputs!D$12","v":"2018/19"},{"$f":"Inputs!E$12","v":"2019/20"},{"$f":"Inputs!F$12","v":"2020/21"},{"$f":"Inputs!G$12","v":"2021/22"},{"$f":"Inputs!H$12","v":"2022/23"},{"$f":"Inputs!I$12","v":"2023/24"},{"$f":"Inputs!J$12","v":"2024/25"}]
["Opening RAB","EDB data",{"$f":"'EDB data'!B28","v":251488.1610056299}]
["Total depreciation","EDB data",{"$f":"'EDB data'!B31","v":9527.5470711652615}]
["Revaluations","EDB data",{"$f":"'EDB data'!B32","v":0}]
["Closing RAB","EDB data",{"$f":"'EDB data'!B33","v":268572.30178670579}]
["Disposed assets","EDB data",null,{"$f":"'EDB data'!$B73","v":29.824630741003414},{"$f":"'EDB data'!$B74","v":30.331649463600471},{"$f":"'EDB data'!$B75","v":30.968614102336076},{"$f":"'EDB data'!$B76","v":31.61895499848513},{"$f":"'EDB data'!$B77","v":32.272413401787155},{"$f":"'EDB data'!$B78","v":32.928619140956819},{"$f":"'EDB data'!$B79","v":33.587191523775957}]
["Value of commissioned assets","EDB data",null,{"$f":"'EDB data'!$B64","v":22622.202911560002},{"$f":"'EDB data'!$B65","v":25001.257268959998},{"$f":"'EDB data'!$B66","v":22807.153782335368},{"$f":"'EDB data'!$B67","v":16698.185971781397},{"$f":"'EDB data'!$B68","v":16364.168998721658},{"$f":"'EDB data'!$B69","v":16657.702826421766},{"$f":"'EDB data'!$B70","v":17735.53136962737}]
{"$rows_left_out":86}
{"sheet":"TAX","index":9,"n_rows":98,"n_cols":10,"rows_kept":98,"cut":false,"hidden":false,"merged":[]}
["Tax calculations",null,null,null,null,null,null,null,null,{"$f":"EDB_Name","v":"Total for selected EDBs"}]
["Calculations involving the roll-forward of adjusted depreciation regulatory asset values, deferred tax and tax adjustments."]
["Inputs"]
[null,"Source","Value",{"$f":"Inputs!D$12","v":"2018/19"},{"$f":"Inputs!E$12","v":"2019/20"},{"$f":"Inputs!F$12","v":"2020/21"},{"$f":"Inputs!G$12","v":"2021/22"},{"$f":"Inputs!H$12","v":"2022/23"},{"$f":"Inputs!I$12","v":"2023/24"},{"$f":"Inputs!J$12","v":"2024/25"}]
["Year in modelling period","EDB data",null,{"$f":"'EDB data'!B21","v":1},{"$f":"'EDB data'!C21","v":2},{"$f":"'EDB data'!D21","v":3},{"$f":"'EDB data'!E21","v":4},{"$f":"'EDB data'!F21","v":5},{"$f":"'EDB data'!G21","v":6},{"$f":"'EDB data'!H21","v":7}]
["Tax rate","EDB data",null,{"$f":"'EDB data'!B25","v":0.28000000000000003},{"$f":"'EDB data'!C25","v":0.28000000000000003},{"$f":"'EDB data'!D25","v":0.28000000000000003},{"$f":"'EDB data'!E25","v":0.28000000000000003},{"$f":"'EDB data'!F25","v":0.28000000000000003},{"$f":"'EDB data'!G25","v":0.28000000000000003},{"$f":"'EDB data'!H25","v":0.28000000000000003}]
["Value of commissioned assets","EDB data",null,{"$f":"'EDB data'!$B64","v":22622.202911560002},{"$f":"'EDB data'!$B65","v":25001.257268959998},{"$f":"'EDB data'!$B66","v":22807.153782335368},{"$f":"'EDB data'!$B67","v":16698.185971781397},{"$f":"'EDB data'!$B68","v":16364.168998721658},{"$f":"'EDB data'!$B69","v":16657.702826421766},{"$f":"'EDB data'!$B70","v":17735.53136962737}]
["Remaining life of newly commissioned assets","EDB data",null,{"$f":"'EDB data'!B13","v":44}]
["Amortisation of initial differences in asset values","EDB data",null,{"$f":"'EDB data'!B38","v":3399.1052631578946}]
["Lost assets","EDB data",null,{"$f":"'EDB data'!B29","v":0}]
{"$rows_left_out":89}
{"sheet":"BBAR","index":10,"n_rows":59,"n_cols":10,"rows_kept":59,"cut":false,"hidden":false,"merged":[]}
["Building blocks allowable revenue",null,null,null,null,null,null,null,null,{"$f":"EDB_Name","v":"Total for selected EDBs"}]
["Derivation of BBAR present value, opening investment value, and TCSD allowance."]
["Inputs"]
[null,"Source","Value",{"$f":"Inputs!D$12","v":"2018/19"},{"$f":"Inputs!E$12","v":"2019/20"},{"$f":"Inputs!F$12","v":"2020/21"},{"$f":"Inputs!G$12","v":"2021/22"},{"$f":"Inputs!H$12","v":"2022/23"},{"$f":"Inputs!I$12","v":"2023/24"},{"$f":"Inputs!J$12","v":"2024/25"}]
["Year in regulatory period","EDB data",null,null,null,{"$f":"'EDB data'!D22","v":1},{"$f":"'EDB data'!E22","v":2},{"$f":"'EDB data'!F22","v":3},{"$f":"'EDB data'!G22","v":4},{"$f":"'EDB data'!H22","v":5}]
["Tax rate","EDB data",null,{"$f":"'EDB data'!B25","v":0.28000000000000003},{"$f":"'EDB data'!C25","v":0.28000000000000003},{"$f":"'EDB data'!D25","v":0.28000000000000003},{"$f":"'EDB data'!E25","v":0.28000000000000003},{"$f":"'EDB data'!F25","v":0.28000000000000003},{"$f":"'EDB data'!G25","v":0.28000000000000003},{"$f":"'EDB data'!H25","v":0.28000000000000003}]
["Other regulated income","EDB data",null,{"$f":"'EDB data'!$B82","v":0},{"$f":"'EDB data'!$B83","v":0},{"$f":"'EDB data'!$B84","v":0},{"$f":"'EDB data'!$B85","v":0},{"$f":"'EDB data'!$B86","v":0},{"$f":"'EDB data'!$B87","v":0},{"$f":"'EDB data'!$B88","v":0}]
["Term credit spread differential allowance","EDB data",null,{"$f":"'EDB data'!B39","v":0}]
["Value of commissioned assets","EDB data",null,{"$f":"'EDB data'!$B64","v":22622.202911560002},{"$f":"'EDB data'!$B65","v":25001.257268959998},{"$f":"'EDB data'!$B66","v":22807.153782335368},{"$f":"'EDB data'!$B67","v":16698.185971781397},{"$f":"'EDB data'!$B68","v":16364.168998721658},{"$f":"'EDB data'!$B69","v":16657.702826421766},{"$f":"'EDB data'!$B70","v":17735.53136962737}]
["Operating expenditure","EDB data",null,{"$f":"'EDB data'!$B46","v":{"$error":"#N/A"}},{"$f":"'EDB data'!$B47","v":{"$error":"#N/A"}},{"$f":"'EDB data'!$B48","v":17657.336474308046},{"$f":"'EDB data'!$B49","v":18209.314126979465},{"$f":"'EDB data'!$B50","v":18754.029575690336},{"$f":"'EDB data'!$B51","v":19260.571627431244},{"$f":"'EDB data'!$B52","v":19636.115822609016}]
{"$rows_left_out":50}
{"sheet":"REV","index":11,"n_rows":28,"n_cols":8,"rows_kept":28,"cut":false,"hidden":false,"merged":[]}
["Revenue growth index",null,null,null,null,null,null,{"$f":"EDB_Name","v":"Total for selected EDBs"}]
["Derivation of the normalised profile of the maximum allowable revenue before tax values."]
["Inputs"]
[null,"Source","Value",{"$f":"Inputs!F$12","v":"2020/21"},{"$f":"Inputs!G$12","v":"2021/22"},{"$f":"Inputs!H$12","v":"2022/23"},{"$f":"Inputs!I$12","v":"2023/24"},{"$f":"Inputs!J$12","v":"2024/25"}]
["Constant price revenue growth","EDB data",null,{"$f":"'EDB data'!$B57","v":0},{"$f":"'EDB data'!$B58","v":0},{"$f":"'EDB data'!$B59","v":0},{"$f":"'EDB data'!$B60","v":0},{"$f":"'EDB data'!$B61","v":0}]
["Industry-wide X factor","EDB data",{"$f":"'EDB data'!B14","v":0}]
["Alternative X factor","EDB data",{"$f":"'EDB data'!B43","v":0}]
["Forecast changes in the CPI element of the price path","EDB data",null,{"$f":"'EDB data'!D24","v":1.97537947804447E-2},{"$f":"'EDB data'!E24","v":2.0749523987959151E-2},{"$f":"'EDB data'!F24","v":2.0666666666666611E-2},{"$f":"'EDB data'!G24","v":2.0333333333333314E-2},{"$f":"'EDB data'!H24","v":1.9999999999999796E-2}]
["Calculations"]
[{"$f":"\"Index of price path with industry-wide X factor of \"&TEXT(C6,\"#0.0%\")","v":"Index of price path with industry-wide X factor of 0.0%"}]
{"$rows_left_out":19}
{"sheet":"MAR","index":12,"n_rows":61,"n_cols":8,"rows_kept":61,"cut":false,"hidden":false,"merged":[]}
["Maximum allowable revenue",null,null,null,null,null,null,{"$f":"EDB_Name","v":"Total for selected EDBs"}]
["Derivation of starting prices."]
["Inputs"]
[null,"Source","Value",{"$f":"Inputs!F$12","v":"2020/21"},{"$f":"Inputs!G$12","v":"2021/22"},{"$f":"Inputs!H$12","v":"2022/23"},{"$f":"Inputs!I$12","v":"2023/24"},{"$f":"Inputs!J$12","v":"2024/25"}]
["Year in regulatory period","EDB data",null,{"$f":"'EDB data'!D22","v":1},{"$f":"'EDB data'!E22","v":2},{"$f":"'EDB data'!F22","v":3},{"$f":"'EDB data'!G22","v":4},{"$f":"'EDB data'!H22","v":5}]
["Industry-wide X factor","EDB data",{"$f":"'EDB data'!B14","v":0}]
["Additional allowance in 1 April 2015 PV terms","EDB data",{"$f":"'EDB data'!B42","v":0}]
["Alternative X factor","EDB data",{"$f":"'EDB data'!B43","v":0}]
["Vanilla WACC (67th percentile)","EDB data",{"$f":"WACC","v":5.1299999999999998E-2}]
["TFrev","TIMING",{"$f":"TIMING!C27","v":1.0204922620112409}]
{"$rows_left_out":52}
{"sheet":"Reconciliation","index":13,"n_rows":63,"n_cols":39,"rows_kept":63,"cut":false,"hidden":false,"merged":[[9,22,9,31],[38,21,38,34],[4,2,4,3],[3,2,3,3],[5,2,5,3],[6,2,6,3],[38,2,38,15]]}
["Reconciliation with financial models outputs"]
["Reconciliation of this waterfall model outputs with 2015 and 2020 financial model outputs",null,null,null,null,"How this sheet operates",null,null,null,null,"Mode is set by Cell C5 on the Waterfall chart.",null,null,null,null,{"$f":"\"Currently, mode = \" & Waterfall!D5","v":"Currently, mode = 14"}]
[null,null,null,null,null,"When the mode is set to 14, the panel with a blue fill colour below (see Cell W11) should be filled with zeros."]
["Distributor",null,"Scenario",null,null,"When the mode is set to 0, the panel with a tan fill colour below (see Cell C40) should be filled with zeros."]
["Name",null,{"$f":"EDB_Name","v":"Total for selected EDBs"}]
["Distributor number",null,{"$f":"'EDB data'!C6","v":14},null,null,null,"Block below with this fill colour is for data table with first argument set to C5, second argument blank."]
[]
[null,"Active EDB outputs",{"$f":"Inputs!C28","v":"Alpine Energy"},{"$f":"Inputs!D28","v":"Aurora Energy"},{"$f":"Inputs!E28","v":"Centralines"},{"$f":"Inputs!F28","v":"EA Networks"},{"$f":"Inputs!G28","v":"Eastland Network"},{"$f":"Inputs!H28","v":"Electricity Invercargill"},{"$f":"Inputs!I28","v":"Horizon Energy"},{"$f":"Inputs!J28","v":"Nelson Electricity"},{"$f":"Inputs!K28","v":"Network Tasman"},{"$f":"Inputs!L28","v":"Orion"},{"$f":"Inputs!M28","v":"OtagoNet"},{"$f":"Inputs!N28","v":"Powerco"},{"$f":"Inputs!O28","v":"The Lines Company"},{"$f":"Inputs!P28","v":"Top Energy"},{"$f":"Inputs!Q28","v":"Unison"},{"$f":"Inputs!R28","v":"Vector"},{"$f":"Inputs!S28","v":"Wellington Electricity"}]
["Distributor number",{"$f":"C6","v":14},{"$f":"Inputs!C29","v":1},{"$f":"Inputs!D29","v":2},{"$f":"Inputs!E29","v":3},{"$f":"Inputs!F29","v":4},{"$f":"Inputs!G29","v":5},{"$f":"Inputs!H29","v":6},{"$f":"Inputs!I29","v":7},{"$f":"Inputs!J29","v":8},{"$f":"Inputs!K29","v":9},{"$f":"Inputs!L29","v":10},{"$f":"Inputs!M29","v":11},{"$f":"Inputs!N29","v":12},{"$f":"Inputs!O29","v":13},{"$f":"Inputs!P29","v":14},{"$f":"Inputs!Q29","v":15},{"$f":"Inputs!R29","v":16},{"$f":"Inputs!S29","v":17}]
["Outputs",null,0,0,0,0,0,0,0,0,0,0,0,0,0,0,0,0,0,null,null,null,"Reconcilation of this waterfall model with the 2020 financial model outputs is achieved when the blue coloured panel below indicates zero values. The #N/A results are from the #N/A values in the draft 2020 DPP reset financial model outputs. This requres the \"mode\" setting at cell D5 on the Waterfall sheet to be set to 14."]
{"$rows_left_out":53}